{"text_format":"1","workbook":"xlsx","n_sheets":18,"sheets":["Enable","User_Agreement","Registration","Home","Login","Staff","Admin","Login_Report","Reports","Data","Support","Profile","RCUBE","Admin_License","Checkin Log","MM","How_To","License_Page"],"not_rendered":{"charts":0,"images":20,"macros":1,"external_links":0,"defined_names":21,"comments":0,"pivot_tables":3},"unopened":[],"bounds":{"document_bytes":16777216,"sheet_cells":100000,"rows_first":2000,"rows_last":500,"rows_between":2000,"halvings":0,"cell_chars":16384,"cell_head_chars":4096},"cells_cut":0,"cells_raw":0,"read":"whole","date_system":"1900"}

{"sheet":"Enable","index":0,"n_rows":27,"n_cols":4,"rows_kept":27,"cut":false,"hidden":false,"merged":[]}
[]
[]
[null,"0001"]
[]
[]
[]
[]
[]
[]
[]
[]
[]
[]
[]
[]
{"$rows_left_out":13}
{"sheet":"User_Agreement","index":1,"n_rows":52,"n_cols":4,"rows_kept":52,"cut":false,"hidden":false,"merged":[[45,2,45,3],[47,2,47,3]]}
[{"$f":"A48","v":"no"}]
[]
[null,null,"TERMS OF SERVICE AND USER AGREEMENT & SYSTEM REQUIREMENTS"]
[null,null,"SYSTEM REQUIREMENTS"]
["a",null,{"$f":"A5","v":"a"},"This \"Employee Clock-in\" Excel Software will only work properly on a PC with Windows. Unfortunately you wont be able to use Mac's at this point."]
["b",null,{"$f":"A6","v":"b"},"You need to have installed a version of Microsoft Excel 2010 or higher."]
["c",null,{"$f":"A7","v":"c"},"The Computer that you will be using to run the \"Employee Clock-in\" Excel Software must be able to connect to the internet."]
[]
[null,null,"TERMS OF SERVICE AND END USER AGREEMENT"]
[null,null,null,"Welcome to the Terms of Service Agreement for using the \"Employee Clock-in\" Excel Software. This agreement describes the terms on which you may access and use \"Employee Clock-in\" Excel Software. To become a Licensed user, accept all of the terms and conditions of this agreement. If you do not agree to be bound by the terms of this Agreement, you may not use nor access our services.\nWe reserve the right to modify this Agreement at any time, and without prior notice, by posting amended terms on this agreement. \nYour continued use of the \"Employee Clock-in\" Excel Software indicates your acceptance of the amended User Agreement.\n"]
[null,null,null,"Licence"]
[null,null,null,"1.    Under this End User Licence Agreement (the \"Agreement\"), RCUBE Solutions (the \"Vendor\") grants to the user (the \"Licensee\") a non-exclusive and non-transferable licence (the \"Licence\") to use Employee Clock-in (the \"Software\")."]
[null,null,null,"2.    \"Software\" includes the executable computer programs, the source code and any related printed, electronic and online documentation and any other files that may accompany the product."]
[null,null,null,"3.    Title, copyright, intellectual property rights and distribution rights of the Software remain exclusively with the Vendor. Intellectual property rights include the look and feel of the Software. This Agreement constitutes a licence for use only and is not in any way a transfer of ownership rights to the Software."]
[null,null,null,"4.    This Agreement grants a site licence to the Licensee. The Software may be loaded onto a maximum of one computer, unless the Licensee purchases a multiple computer license."]
{"$rows_left_out":38}
{"sheet":"Registration","index":2,"n_rows":24,"n_cols":6,"rows_kept":24,"cut":false,"hidden":false,"merged":[]}
[]
["Field check",{"$f":"IF(B3=\"N\",IF(A12>0,\"No\",\"OK\"),\"NO\")","v":"No"}]
["Registered","N",null,null,null,"LICENSE REGISTRATION"]
["Overall Trial",{"$f":"Admin_License!K15","v":"OK"}]
[]
[null,null,null,null,null,"1) To REGISTER your License, please fill the fields below."]
[null,null,null,null,null,"2) When you click \"REGISTER\", a  \"csv\" file will be saved in your desktop under the name of \"License_Registration_Checkin.csv\""]
[null,null,null,null,null,"3) Please send that file to registration@rcubesolutions.ca"]
[null,null,null,null,null,"4) You will then a get an email confirming your registration (could take 24-48 hours)"]
[]
[null,null,null,null,null,"Please fill all mandatory Fields (*). Ensure is accurate data"]
[{"$f":"SUM(A14:A23)","v":7}]
[null,null,null,null,"License #",{"$f":"IF(B2=\"No\",\"\",Admin_License!P32)","v":""}]
[{"$f":"IF(F14=\"\",1,0)","v":1},null,null,null,"* Full Name"]
[{"$f":"IF(F15=\"\",1,0)","v":1},null,null,null," * Company Name"]
{"$rows_left_out":10}
{"sheet":"Home","index":3,"n_rows":29,"n_cols":17,"rows_kept":29,"cut":false,"hidden":false,"merged":[[28,2,29,11]]}
[]
[]
[]
[]
[]
[]
[]
[null,null,"Employee Clock-in Platform",null,null,null,null,null,null,null,"version 3.3"]
[]
[]
[]
[null,null,"STAFF",null,null,null,"MANAGERS",null,null,null,null,null,"SUPPORT"]
[]
[null,null,null,null,null,null,null,null,null,null,null,null,null,null,null,{"$f":"Staff!I12","v":"password"},{"$f":"IF(P14=Login!C15,\"OK\",\"NO\")","v":"NO"}]
[]
{"$rows_left_out":15}
{"sheet":"Login","index":4,"n_rows":39,"n_cols":31,"rows_kept":39,"cut":false,"hidden":false,"merged":[]}
[null,null,null,null,null,null,null,null,null,null,null,null,{"$f":"\"Staff!D11:D\"&Staff!D1","v":"Staff!D11:D12"}]
[]
[]
[]
[]
[]
[]
[]
[]
[null,{"$f":"TODAY()","v":"2017-11-26"}]
[null,null,null,null,null,null,null,null,null,null,null,"Staff Name:","Rey"]
[]
["Name","Date","Time","Log","Ref","Count","IN","Out","Check"]
[{"$f":"List_Staff_login","v":"Rey"},{"$f":"TODAY()","v":"2017-11-26"},{"$f":"NOW()","v":"2017-11-26T23:18:56.240"},null,{"$f":"MATCH(F14&A14&B14,Data!D:D,0)","v":{"$error":"#N/A"}},{"$f":"COUNTIFS(Data!T:T,Login!A14,Data!U:U,Login!B14)","v":0},{"$f":"COUNTIFS(Data!T:T,Login!A14,Data!U:U,Login!B14,Data!W:W,Login!$G$13)","v":0},{"$f":"COUNTIFS(Data!T:T,Login!A14,Data!U:U,Login!B14,Data!X:X,\">0\")","v":0},{"$f":"IF(G14=H14,\"IN\",\"OUT\")","v":"IN"}]
["Pass",{"$f":"IFERROR(VLOOKUP(A14,Staff!D:L,6,FALSE),\"\")","v":""},"xx",{"$f":"IF(C15=\"\",\"NO\",IF(C15=B15,\"OK\",\"NO\"))","v":"NO"},null,null,null,null,null,null,null,null,null,"Time IN","Time OUT","Time IN","Time OUT","Time IN","Time OUT","Time IN","Time OUT"]
{"$rows_left_out":25}
{"sheet":"Staff","index":5,"n_rows":61,"n_cols":12,"rows_kept":61,"cut":false,"hidden":true,"merged":[]}
[null,null,null,{"$f":"COUNTIF(A11:A100,\"OK\")+10","v":12}]
[]
[]
[]
[]
[]
[]
[]
[{"$f":"IF(Admin_License!AI2=\"\",10,Admin_License!AI2)+1","v":11}]
[null,null,"ID #","Full Name","Staff Type","Full/Part Time","Hourly Rate","Stat. Holiday\n (# of Hours)","Password","Start Date","End Date","Time in Practice (years)"]
["OK",null,0,"(Select One)",null,null,null,null,null,null,null,{"$f":"IF(D11=\"\",\"\",IF(K11=\"\",TODAY()-J11,K11-J11))/365","v":117.98630136986301}]
["OK",null,1,"Manager","Manager",null,null,null,"password"]
[{"$f":"IF(C13>$A$9,\"NO\",IF(D13=\"\",\"\",\"OK\"))","v":""},null,2,null,null,null,null,null,null,null,null,{"$f":"IF(D13=\"\",\"\",(IF(K13=\"\",TODAY()-J13,K13-J13)/365))","v":""}]
[{"$f":"IF(C14>$A$9,\"NO\",IF(D14=\"\",\"\",\"OK\"))","v":""},null,3,null,null,null,null,null,null,null,null,""]
["",null,4,null,null,null,null,null,null,null,null,""]
{"$rows_left_out":47}
{"sheet":"Admin","index":6,"n_rows":47,"n_cols":14,"rows_kept":47,"cut":false,"hidden":true,"merged":[]}
[]
[]
[]
[]
[]
[null,null,"ADMIN"]
[null,null,"Pay Period Start","Pay Period End","Pay Period Number","# of Holidays","Period",null,"Days",null,null,"Staff Type",null,"Full/Part Time"]
[null,null,"2017-09-01",{"$f":"C8+14","v":"2017-09-15"},1,null,{"$f":"TEXT(C8,\"d-mmm\")&\"/\" &TEXT(D8,\"d-mmm\")","v":"1-Sep/15-Sep"},{"$f":"C8","v":"2017-09-01"},{"$f":"H9-H8","v":15},null,null,".",null,"Full Time"]
[null,null,{"$f":"D8+1","v":"2017-09-16"},{"$f":"EOMONTH(C9,0)","v":"2017-09-30"},{"$f":"E8+1","v":2},null,{"$f":"TEXT(C9,\"d-mmm\")&\"/\" &TEXT(D9,\"d-mmm\")","v":"16-Sep/30-Sep"},{"$f":"C9","v":"2017-09-16"},{"$f":"H10-H9","v":15},null,null,".",null,"Part Time"]
[null,null,{"$f":"D9+1","v":"2017-10-01"},{"$f":"C10+14","v":"2017-10-15"},{"$f":"E9+1","v":3},null,"1-Oct/15-Oct","2017-10-01",15,null,null,".",null,"Contract"]
[null,null,{"$f":"D10+1","v":"2017-10-16"},{"$f":"EOMONTH(C11,0)","v":"2017-10-31"},4,null,"16-Oct/31-Oct","2017-10-16",16,null,null,".",null,"."]
[null,null,{"$f":"D11+1","v":"2017-11-01"},{"$f":"C12+14","v":"2017-11-15"},5,null,"1-Nov/15-Nov","2017-11-01",15,null,null,".",null,"."]
[null,null,{"$f":"D12+1","v":"2017-11-16"},{"$f":"EOMONTH(C13,0)","v":"2017-11-30"},6,null,"16-Nov/30-Nov","2017-11-16",15,null,null,".",null,"."]
[null,null,"2017-12-01",{"$f":"C14+14","v":"2017-12-15"},7,null,"1-Dec/15-Dec","2017-12-01",15,null,null,".",null,"."]
[null,null,"2017-12-16",{"$f":"EOMONTH(C15,0)","v":"2017-12-31"},8,null,"16-Dec/31-Dec","2017-12-16",16,null,null,".",null,"."]
{"$rows_left_out":33}
{"sheet":"Login_Report","index":7,"n_rows":39,"n_cols":62,"rows_kept":39,"cut":false,"hidden":true,"merged":[[16,15,16,16]]}
[null,null,null,null,null,null,null,null,null,null,null,null,{"$f":"\"Staff!D11:D\"&Staff!D1","v":"Staff!D11:D12"}]
[]
[]
[]
[]
[]
[]
[]
[]
[null,{"$f":"TODAY()","v":"2017-11-26"},null,null,null,null,null,null,null,null,null,null,"MANAGER's LOGIN REPORT"]
[]
[]
[]
[]
["Pass",{"$f":"IFERROR(VLOOKUP(A14,Staff!D:L,6,FALSE),\"\")","v":""},null,"OK",null,null,null,null,null,null,null,null,null,"Time IN","Time OUT","Time IN","Time OUT","Time IN","Time OUT","Time IN","Time OUT",null,null,null,null,null,null,null,null,null,null,null,null,null,"OK",null,null,null,null,null,null,null,null,null,"Time IN","Time OUT","Time IN","Time OUT","Time IN","Time OUT","Time IN","Time OUT"]
{"$rows_left_out":25}
{"sheet":"Reports","index":8,"n_rows":40,"n_cols":16,"rows_kept":40,"cut":false,"hidden":true,"merged":[]}
[]
[]
[]
[]
[]
[]
[null,null,null,null,{"$f":"\"Pay Period \"&$B$18&\":\"","v":"Pay Period (All):"},{"$f":"IFERROR(VLOOKUP($B$18,Admin!$E:$G,3,FALSE),\"\")","v":""},null,null,null,null,null,null,null,null,{"$f":"IFERROR(IF(K7=\"\",\"\",VLOOKUP(K7,Staff!D:L,6,FALSE)),\"\")","v":""},{"$f":"IF(K7=\"\",\"\",O7*N7)","v":""}]
[null,null,null,null,"Total Hours Period",null,null,null,null,null,"Total Hours Period by Week & Day"]
[null,null,null,null,null,null,null,null,null,null,"Sum of Hours Worked",null,"Months","Date"]
[null,null,null,null,"Name","Hours Worked ","# Holidays in Period","Holiday Hours","TOTAL HOURS",null,null,null,"Oct","Grand Total"]
[null,null,null,null,"Rey",1.7083333223126829E-3,{"$f":"IFERROR(IF(E11=\"\",\"\",VLOOKUP($B$18,Admin!E:F,2,FALSE)),\"\")","v":""},{"$f":"IFERROR(IF(E11=\"\",\"\",VLOOKUP(E11,Staff!D:H,5,FALSE)*G11),\"\")","v":""},{"$f":"IFERROR(IF(E11=\"\",\"\",H11+F11),\"\")","v":""},null,"Name","Week"]
[null,null,null,null,null,null,{"$f":"IFERROR(IF(E12=\"\",\"\",VLOOKUP($B$18,Admin!E:F,2,FALSE)),\"\")","v":""},{"$f":"IFERROR(IF(E12=\"\",\"\",VLOOKUP(E12,Staff!D:H,5,FALSE)*G12),\"\")","v":""},{"$f":"IFERROR(IF(E12=\"\",\"\",H12+F12),\"\")","v":""},null,"Rey",42,1.7083333223126829E-3,1.7083333223126829E-3]
[null,null,null,null,null,null,{"$f":"IFERROR(IF(E13=\"\",\"\",VLOOKUP($B$18,Admin!E:F,2,FALSE)),\"\")","v":""},{"$f":"IFERROR(IF(E13=\"\",\"\",VLOOKUP(E13,Staff!D:H,5,FALSE)*G13),\"\")","v":""},"",null,"Rey Total",null,1.7083333223126829E-3,1.7083333223126829E-3]
[null,null,null,null,null,null,{"$f":"IFERROR(IF(E14=\"\",\"\",VLOOKUP($B$18,Admin!E:F,2,FALSE)),\"\")","v":""},{"$f":"IFERROR(IF(E14=\"\",\"\",VLOOKUP(E14,Staff!D:H,5,FALSE)*G14),\"\")","v":""},"",null,"Grand Total",null,1.7083333223126829E-3,1.7083333223126829E-3]
[null,null,null,null,null,null,{"$f":"IFERROR(IF(E15=\"\",\"\",VLOOKUP($B$18,Admin!E:F,2,FALSE)),\"\")","v":""},{"$f":"IFERROR(IF(E15=\"\",\"\",VLOOKUP(E15,Staff!D:H,5,FALSE)*G15),\"\")","v":""},""]
{"$rows_left_out":26}
{"sheet":"Data","index":9,"n_rows":5,"n_cols":24,"rows_kept":5,"cut":false,"hidden":true,"merged":[]}
["Count",{"$f":"COUNTA(T5:T199989)+5","v":5},null,null,1,{"$f":"24*60*60","v":86400}]
[]
[null,{"$f":"IF(T3=\"\",\"NO\",\"OK\")","v":"OK"},{"$f":"COUNTIFS(T3:T$4,T3,U3:U$4,U3,W3:W$4,W3)","v":0},{"$f":"C3&T3&U3","v":"0RAW DATA "},{"$f":"IF(X3=\"\",0,X3-V3)","v":0},{"$f":"IFERROR(E3*$F$1/60/60,0)","v":0},{"$f":"MONTH(U3)","v":1},{"$f":"YEAR(U3)","v":1900},{"$f":"WEEKNUM(U3)","v":0},{"$f":"TEXT(WEEKDAY(U3,1),\"ddd\")","v":"Sat"},{"$f":"VLOOKUP(U3,Admin!C:F,3)","v":{"$error":"#N/A"}},{"$f":"VLOOKUP($T3,Staff!$D:$L,3,FALSE)","v":{"$error":"#N/A"}},{"$f":"VLOOKUP($T3,Staff!$D:$L,2,FALSE)","v":{"$error":"#N/A"}},{"$f":"VLOOKUP($T3,Staff!$D:$L,5,FALSE)","v":{"$error":"#N/A"}},{"$f":"VLOOKUP($T3,Staff!$D:$L,4,FALSE)","v":{"$error":"#N/A"}},{"$f":"O3*F3","v":{"$error":"#N/A"}},null,null,null,"RAW DATA "]
[null,"Check","Count In","Unique","Difference","Hours Worked","Month","Year","Week","Week Day","Pay Period","Part/Full Time","Type","Vacation","Rate","Pay","xxx","xxxx","xxxxx","Name","Date","Time IN","Type","Time OUT"]
[null,"OK"]

{"sheet":"Support","index":10,"n_rows":20,"n_cols":8,"rows_kept":20,"cut":false,"hidden":false,"merged":[]}
[]
[]
[]
[]
[null,null,null,null,"Support"]
[]
[null,null,null,null,null,"License Serial #:",null,{"$f":"Profile!$G$8","v":0}]
[]
[null,null,null,null,null,"support@rcubesolutions.ca"]
[null,null,null,null,null,"If applicable, please attach screen shots of the related topic your are emailing us about."]
[]
[]
[]
[null,null,null,null,null," 1-800-291-9608"]
[null,null,null,null,null,"We might be busy when you call. Feel free to leave us a voicemail."]
{"$rows_left_out":6}
{"sheet":"Profile","index":11,"n_rows":48,"n_cols":8,"rows_kept":48,"cut":false,"hidden":false,"merged":[[1,4,1,7]]}
[]
[null,null,null,null,{"$f":"Admin_License!D2","v":"THE USER AGREEMENT HAS NOT BEEN ACCEPTED YET. PLEASE DO SO FIRST"}]
[null,null,null,null,null,"YOUR PROFILE"]
[null,null,null,null,null,"Today's Date:",{"$f":"NOW()","v":"2017-11-26T23:18:56.240"}]
[]
[null,null,null,null,null,"Contact Information (Update GREEN Cells is applicable)"]
[]
[null,null,null,null,null,"License Serial #"]
[null,null,null,null,null,"Full Name"]
[null,null,null,null,null,"Club Name"]
[null,null,null,null,null,"* Email"]
[null,null,null,null,null,"* Phone #"]
[null,null,null,null,null,"Address 1"]
[null,null,null,null,null,"Address 2"]
[null,null,null,null,null,"* City"]
{"$rows_left_out":34}
{"sheet":"RCUBE","index":12,"n_rows":21,"n_cols":14,"rows_kept":21,"cut":false,"hidden":true,"merged":[]}
["xxx"]
[null,null,null,"Today",0,null,null,null,null,null,null,null,"Countries"]
["Where I am at",null,null,"Yesterday",1,null,null,null,null,null,null,null,"Canada","CA"]
["GEN LICENSE INFO",null,null,"2 days ago",2,null,null,null,null,null,null,null,"United States","US"]
[null,null,null,"3 days ago",3,null,null,null,null,null,null,null,"Mexico","MX"]
[null,null,null,null,null,null,null,null,null,null,null,null,"United Kingdom","UK"]
[null,null,null,null,null,null,null,null,null,null,null,null,"Other","OT"]
[null,null,null,null,null,null,null,null,null,null,null,null,"."]
[null,null,null,null,null,null,null,null,null,null,null,null,"."]
[null,null,null,null,"2017-09-30",{"$f":"TODAY()","v":"2017-11-26"},{"$f":"VLOOKUP(Admin_License!A2,RCUBE!C14:D21,2,FALSE)","v":"NO"},null,null,null,null,null,"."]
[null,null,null,null,null,null,null,null,null,null,null,null,"."]
[null,null,null,null,null,null,null,null,null,null,null,null,"."]
[null,null,null,null,null,null,null,null,null,null,null,null,"."]
[null,null,1,"OK",{"$f":"\"THIS IS A NON-REGISTERED AND UN-SUPPORTED LIMITED TRIAL LICENSE  WITH \"&M14&\" DAYS LEFT - RECOMMENDED TO REGISTER YOU LICENSE BY GOING TO THE LICENSE SECTION\"","v":"THIS IS A NON-REGISTERED AND UN-SUPPORTED LIMITED TRIAL LICENSE  WITH . DAYS LEFT - RECOMMENDED TO REGISTER YOU LICENSE BY GOING TO THE LICENSE SECTION"},null,null,null,null,null,null,null,"."]
[null,null,2,"OK",{"$f":"\"THIS IS A TRIAL LICENSE WITH \"&M14&\" DAYS LEFT\"","v":"THIS IS A TRIAL LICENSE WITH . DAYS LEFT"}]
{"$rows_left_out":7}
{"sheet":"Admin_License","index":13,"n_rows":49,"n_cols":39,"rows_kept":49,"cut":false,"hidden":true,"merged":[]}
["STATUS",null,null,null,null,null,null,null,null,"Trial","TRIAL 1",null,null,"MUST Validations",null,null,null,null,null,null,null,null,null,null,null,null,null,"Unique_ID","Standing","Payment date","User","PC","Multiple Users","Bill Cycle","xx","Message"]
[{"$f":"IF(K30=\"OK\",IF(AB2=\"\",1,IF(M3=\"CANCELLED\",7,IF(M3=\"New\",IF(K6>=0,2,3),IF(O6=0,IF(K21=\"OK\",4,5),6)))),8)","v":8},{"$f":"IF(AC2=\"\",1,IF(N3=\"CANCELLED\",7,IF(N3=\"New\",IF(L6>=0,2,3),IF(P6=0,IF(L21=\"OK\",4,5),6))))","v":1},null,{"$f":"VLOOKUP(A2,A6:C14,3,FALSE)","v":"THE USER AGREEMENT HAS NOT BEEN ACCEPTED YET. PLEASE DO SO FIRST"},null,null,null,null,null,"Start date",{"$f":"IF(AND(AC2=\"TRIAL\",AD2>0),AD2,IF(User_Agreement!C52=\"\",TODAY(),User_Agreement!C52))","v":"2017-11-26"},null,null,"Validate",{"$f":"IF(AD2=\"OK\",0,SUM(O3:O16))","v":0},null,null,null,null,null,null,null,null,null,null,null,null,null,null,null,null,null,null,null,null,null,"","",60]
["F",null,null,null,null,null,null,null,null,"Trial Days",12,null,{"$f":"IF(OR(AC2=\"\",AC2=\"TRIAL\"),\"New\",AC2)","v":"New"},"Good Standing",{"$f":"IF(M3=\"New\",0,IF(K21=\"OK\",0,1))","v":0}]
[null,null,null,null,null,null,null,null,null,"Expiry Date",{"$f":"K2+K3","v":"2017-12-08"},null,{"$f":"M3","v":"New"},"30 day Trial",{"$f":"IF(M4<>\"New\",0,IF(K7=\"OK\",0,1))","v":0},null,null,null,null,null,null,null,"2017-09-10T00:30:33"]
[null,null,null,null,null,null,null,null,null,"Today",{"$f":"TODAY()","v":"2017-11-26"},null,{"$f":"M4","v":"New"},"Trial Overall",{"$f":"IF(M5<>\"New\",0,IF(K15=\"OK\",0,1))","v":0},{"$f":"IF(N5<>\"New\",0,IF(L15=\"OK\",0,1))","v":0}]
[1,"1-Trial Not regiestered",{"$f":"\"THIS IS A NON-REGISTERED AND UN-SUPPORTED LIMITED TRIAL LICENSE  WITH \"&K$6&\" DAYS LEFT - RECOMMENDED TO REGISTER YOU LICENSE BY GOING TO THE LICENSE SECTION\"","v":"THIS IS A NON-REGISTERED AND UN-SUPPORTED LIMITED TRIAL LICENSE  WITH 12 DAYS LEFT - RECOMMENDED TO REGISTER YOU LICENSE BY GOING TO THE LICENSE SECTION"},null,null,null,null,null,null,"Days Left",{"$f":"ROUND(K4-K5,0)","v":12},null,{"$f":"M5","v":"New"},"User Validation",{"$f":"IF(OR(M6=\"New\",AG2=\"Y\"),0,IF(AND(N10=AE2,AF2=N11),0,1))","v":0}]
[2,"2-Trial Registered",{"$f":"\"THIS IS A TRIAL LICENSE WITH \"&K$6&\" DAYS LEFT\"","v":"THIS IS A TRIAL LICENSE WITH 12 DAYS LEFT"},null,null,null,null,null,null,"OK",{"$f":"IF(K6>0,\"OK\",\"NO\")","v":"OK"}]
[3,"3-Trial Expired",{"$f":"\"THIS IS AN EXPIRED TRIAL LICENSE - PLEASE GO TO LICENSE SECTION TO PURCHASE A FULL LICENSE\"","v":"THIS IS AN EXPIRED TRIAL LICENSE - PLEASE GO TO LICENSE SECTION TO PURCHASE A FULL LICENSE"}]
[4,"4-Full Paid",{"$f":"\"THIS IS A FULL LICENSE WITH \"&K$20&\" DAYS LEFT\"","v":"THIS IS A FULL LICENSE WITH -43065 DAYS LEFT"},null,null,null,null,null,null,"Overall",null,null,"Logged as"]
[5,"5-Full Expired",{"$f":"\"THIS IS AN EXPIRED FULL LICENSE - PLEASE GO TO LICENSE SECTION TO RENEW YOUR LICENSE\"","v":"THIS IS AN EXPIRED FULL LICENSE - PLEASE GO TO LICENSE SECTION TO RENEW YOUR LICENSE"},null,null,null,null,null,null,"Start date",{"$f":"N36","v":"2017-11-20"},null,"User","RCUBE Solutions"]
[6,"6-Invalid User License",{"$f":"\"CURRENT USER IS NOT THE AUTHORIZED USER OF THIS LICENSE - PLEASE GO TO THE LICENSE SECTION FOR MORE INFORMATION\"","v":"CURRENT USER IS NOT THE AUTHORIZED USER OF THIS LICENSE - PLEASE GO TO THE LICENSE SECTION FOR MORE INFORMATION"},null,null,null,null,null,null,"Trial Days",120,null,"Computer","RCUBESOLUTIONS"]
[7,"7-Cancelled License",{"$f":"\"THIS LICENSE WAS CANCELLED / UPGRADED / TRANSFER BY THE USER - CONTACT SUPPORT IF YOU THINK THIS IS A MISTAKE\"","v":"THIS LICENSE WAS CANCELLED / UPGRADED / TRANSFER BY THE USER - CONTACT SUPPORT IF YOU THINK THIS IS A MISTAKE"},null,null,null,null,null,null,"Expiry Date",{"$f":"K10+K11","v":"2018-03-20"}]
[8,"8-No Agreement","THE USER AGREEMENT HAS NOT BEEN ACCEPTED YET. PLEASE DO SO FIRST",null,null,null,null,null,null,"Today",{"$f":"TODAY()","v":"2017-11-26"}]
[null,null,null,null,null,null,null,null,null,"Days Left",{"$f":"K12-K13","v":114}]
[null,null,null,null,null,null,null,null,null,"OK",{"$f":"IF(K14>0,\"OK\",\"NO\")","v":"OK"}]
{"$rows_left_out":35}
{"sheet":"Checkin Log","index":14,"n_rows":241,"n_cols":25,"rows_kept":241,"cut":false,"hidden":true,"merged":[]}
["Checkin Number","User Name","Computer Name","Log date","Year","Month","Week","Weekday",{"$f":"COUNTA(B1:B1500)+1","v":2},null,null,null,{"$f":"COUNTA(O1:O150000)+1","v":2},"Usage Track #","User Name","Computer Name","Open Date",null,null,null,null,null,null,"Last Login","Sub savepdfma()"]
[null,null,null,null,null,null,null,null,null,null,null,null,null,null,null,null,null,null,null,null,null,null,{"$f":"\"O\"&M1-1","v":"O1"},{"$f":"INDIRECT(W2)","v":"User Name"},"Sub folders"]
[null,null,null,null,null,null,null,null,null,null,null,null,null,null,null,null,null,null,null,null,null,null,{"$f":"\"P\"&M1-1","v":"P1"},{"$f":"INDIRECT(W3)","v":"Computer Name"},"UDF module"]
[null,null,null,null,null,null,null,null,null,null,null,null,null,null,null,null,null,null,null,null,null,null,"2017-10-23T22:21:44",{"$f":"X2&\" - \"&X3","v":"User Name - Computer Name"},"RefPIVOTS"]
[null,null,null,null,null,null,null,null,null,null,null,null,null,null,null,null,null,null,null,null,null,null,null,"Last Checkin file"]
[]
[]
[]
[]
[]
[]
[]
[]
[]
[]
{"$rows_left_out":227}
{"sheet":"MM","index":15,"n_rows":182,"n_cols":12,"rows_kept":182,"cut":false,"hidden":true,"merged":[]}
["Unique_ID","Standing","Payment date","User","PC","Multiple Users","Bill Cycle","Last Pay","Message","Next Payment","Authorized COMPUTER","Amount"]
["V003ENCAGN0001RCUBREYX0002","N",43023,"RCUBE Solutions","RCUBESOLUTIONS","N",30,"","Tom, please contact me when you can","3","",60]
["V004ENCAGN0001CUBERRXX0001","OK",43059,"RCUBE Solutions","RCUBESOLUTIONS","N",10,"3","Testing new functionality","3","",60]
["","",null,"","","",null,"","","",""]
["","",null,"","","",null,"","","",""]
["","",null,"","","",null,"","","",""]
["","",null,"","","",null,"","","",""]
["","",null,"","","",null,"","","",""]
["","",null,"","","",null,"","","",""]
["","",null,"","","",null,"","","",""]
["","",null,"","","",null,"","","",""]
["","",null,"","","",null,"","","",""]
["","",null,"","","",null,"","","",""]
["","",null,"","","",null,"","","",""]
["","",null,"","","",null,"","","",""]
{"$rows_left_out":168}
{"sheet":"How_To","index":16,"n_rows":20,"n_cols":7,"rows_kept":20,"cut":false,"hidden":true,"merged":[[20,4,20,5],[20,6,20,10],[21,4,21,5],[21,6,21,10],[22,4,22,5],[22,6,22,10],[23,4,23,5],[23,6,23,10],[24,4,24,5],[24,6,24,10],[25,4,25,5],[25,6,25,10],[26,4,26,5],[26,6,26,10],[27,4,27,5],[27,6,27,10],[28,4,28,5],[28,6,28,10],[29,4,29,5],[29,6,29,10],[30,4,30,5],[30,6,30,10],[31,4,31,5],[31,6,31,10],[32,4,32,5],[32,6,32,10],[33,4,33,5],[33,6,33,10],[34,4,34,5],[34,6,34,10],[35,4,35,5],[35,6,35,10],[36,4,36,5],[36,6,36,10],[37,4,37,5],[37,6,37,10],[38,4,38,5],[38,6,38,10],[39,4,39,5],[39,6,39,10],[40,4,40,5],[40,6,40,10]]}
[]
[]
[]
[]
[null,null,null,null,"How to's"]
[]
[]
[null,null,null,null,"This software was meant to be user friendly and common sense driven,"]
[null,null,null,null,"so that the need of How To's was not that important."]
[null,null,null,null,"But we also know that is always good to have some materials to help or "]
[null,null,null,null,"guide our users. "]
[null,null,null,null,"Anywhere you see this icon               , you can click on it to access detailed"]
[null,null,null,null,"information on that section."]
[null,null,null,null,"Below is a list of all the supporting materials."]
[null,null,null,null,"Please click on the Topic you need more info for."]
{"$rows_left_out":6}
{"sheet":"License_Page","index":17,"n_rows":43,"n_cols":30,"rows_kept":43,"cut":false,"hidden":true,"merged":[]}
[{"$f":"Profile!G8","v":0}]
[]
[]
[null,null,null,null,"LICENSING",null,null,null,null,null,null,null,null,null,null,null,null,"Renewal / Purchase"]
[null,null,null,null,"License Serial #:"]
[]
[null,null,null,null,null,null,null,null,null,null,null,null,null,null,null,null,null,null,"Please contact us at info@rcubesolutions.ca"]
[]
[null,null,null,null,null,null,null,null,null,null,null,null,null,null,null,null,null,null,"or click on the link for more information:  ",null,null,null,null,null,null,"http://tournamentscheduler.ca/pricing/"]
[]
[]
[]
[]
[]
[]
{"$rows_left_out":28}