{"text_format":"1","workbook":"xlsx","n_sheets":18,"sheets":["Enable","User_Agreement","Registration","Home","Login","Staff","Admin","Login_Report","Reports","Data","Support","Profile","RCUBE","Admin_License","Checkin Log","MM","How_To","License_Page"],"not_rendered":{"charts":0,"images":20,"macros":1,"external_links":0,"defined_names":21,"comments":0,"pivot_tables":3},"unopened":[],"bounds":{"document_bytes":16777216,"sheet_cells":100000,"rows_first":2000,"rows_last":500,"rows_between":2000,"halvings":0,"cell_chars":16384,"cell_head_chars":4096},"cells_cut":0,"cells_raw":0,"read":"whole","date_system":"1900"}

{"sheet":"Enable","index":0,"n_rows":27,"n_cols":4,"rows_kept":27,"cut":false,"hidden":false,"merged":[]}
[]
[]
[null,"0001"]
[]
[]
[]
[]
[]
[]
[]
[]
[]
[]
[]
[]
[]
[]
[]
[]
[null,null,null,"Make sure you click on ENABLE CONTENT and/or ENABLE EDITING"]
[]
[]
[]
[]
[]
[]
[null,null,null,"CLICK on NEXT if after updating the file, you still see this screen"]

{"sheet":"User_Agreement","index":1,"n_rows":52,"n_cols":4,"rows_kept":52,"cut":false,"hidden":false,"merged":[[45,2,45,3],[47,2,47,3]]}
[{"$f":"A48","v":"no"}]
[]
[null,null,"TERMS OF SERVICE AND USER AGREEMENT & SYSTEM REQUIREMENTS"]
[null,null,"SYSTEM REQUIREMENTS"]
["a",null,{"$f":"A5","v":"a"},"This \"Employee Clock-in\" Excel Software will only work properly on a PC with Windows. Unfortunately you wont be able to use Mac's at this point."]
["b",null,{"$f":"A6","v":"b"},"You need to have installed a version of Microsoft Excel 2010 or higher."]
["c",null,{"$f":"A7","v":"c"},"The Computer that you will be using to run the \"Employee Clock-in\" Excel Software must be able to connect to the internet."]
[]
[null,null,"TERMS OF SERVICE AND END USER AGREEMENT"]
[null,null,null,"Welcome to the Terms of Service Agreement for using the \"Employee Clock-in\" Excel Software. This agreement describes the terms on which you may access and use \"Employee Clock-in\" Excel Software. To become a Licensed user, accept all of the terms and conditions of this agreement. If you do not agree to be bound by the terms of this Agreement, you may not use nor access our services.\nWe reserve the right to modify this Agreement at any time, and without prior notice, by posting amended terms on this agreement. \nYour continued use of the \"Employee Clock-in\" Excel Software indicates your acceptance of the amended User Agreement.\n"]
[null,null,null,"Licence"]
[null,null,null,"1.    Under this End User Licence Agreement (the \"Agreement\"), RCUBE Solutions (the \"Vendor\") grants to the user (the \"Licensee\") a non-exclusive and non-transferable licence (the \"Licence\") to use Employee Clock-in (the \"Software\")."]
[null,null,null,"2.    \"Software\" includes the executable computer programs, the source code and any related printed, electronic and online documentation and any other files that may accompany the product."]
[null,null,null,"3.    Title, copyright, intellectual property rights and distribution rights of the Software remain exclusively with the Vendor. Intellectual property rights include the look and feel of the Software. This Agreement constitutes a licence for use only and is not in any way a transfer of ownership rights to the Software."]
[null,null,null,"4.    This Agreement grants a site licence to the Licensee. The Software may be loaded onto a maximum of one computer, unless the Licensee purchases a multiple computer license."]
[null,null,null,"5.    The rights and obligations of this Agreement are personal rights granted to the Licensee only. The Licensee may not transfer or assign any of the rights or obligations granted under this Agreement to any other person or legal entity. The Licensee may not make available the Software for use by one or more third parties."]
[null,null,null,"6.    The Software may not be modified, reverse-engineered, or de-compiled in any manner through current or future available technologies."]
[null,null,null,"7.    Failure to comply with any of the terms under the Licence section will be considered a material breach of this Agreement."]
[null,null,null,"Limitation of Liability"]
[null,null,null,"8.    The Software is provided by the Vendor and accepted by the Licensee \"as is\". Liability of the Vendor will be limited to a maximum of the original purchase price of the Software. The Vendor will not be liable for any general, special, incidental or consequential damages including, but not limited to, loss of production, loss of profits, loss of revenue, loss of data, or any other business or economic disadvantage suffered by the Licensee arising out of the use or failure to use the Software."]
[null,null,null,"9.    The Vendor makes no warranty expressed or implied regarding the fitness of the Software for a particular purpose or that the Software will be suitable or appropriate for the specific requirements of the Licensee."]
[null,null,null,"10.    The Vendor does not warrant that use of the Software will be uninterrupted or error-free. The Licensee accepts that software in general is prone to bugs and flaws within an acceptable level as determined in the industry."]
[null,null,null,"Warrants and Representations"]
[null,null,null,"11.    The Vendor warrants and represents that it is the copyright holder of the Software. The Vendor warrants and represents that granting the licence to use this Software is not in violation of any other agreement, copyright or applicable statute."]
[null,null,null,"Acceptance"]
[null,null,null,"12.    All terms, conditions and obligations of this Agreement will be deemed to be accepted by the Licensee (\"Acceptance\") on the entering their name and clicking of the \"I ACCEPT\" button below. This action will also generate a digital signature by time stamping and capturing the Computer and User name."]
[null,null,null,"Term"]
[null,null,null,"13.    The term of this Agreement will begin on Acceptance and is perpetual."]
[null,null,null,"Termination"]
[null,null,null,"14.    This Agreement will be terminated and the Licence forfeited where the Licensee has failed to comply with any of the terms of this Agreement or is in breach of this Agreement. On termination of this Agreement for any reason, the Licensee will promptly destroy the Software or return the Software to the Vendor."]
[null,null,null,"Force Majeure"]
[null,null,null,"15.    The Vendor will be free of liability to the Licensee where the Vendor is prevented from executing its obligations under this Agreement in whole or in part due to Force Majeure, such as earthquake, typhoon, flood, fire, and war or any other unforeseen and uncontrollable event where the Vendor has taken any and all appropriate action to mitigate such an event."]
[null,null,null,"Governing Law"]
[null,null,null,"16.    The Parties to this Agreement submit to the jurisdiction of the courts of the Province of Ontario for the enforcement of this Agreement or any arbitration award or decision arising from this Agreement. This Agreement will be enforced or construed according to the laws of the Province of Ontario."]
[null,null,null,"Miscellaneous"]
[null,null,null,"17.    This Agreement can only be modified in writing signed by both the Vendor and the Licensee."]
[null,null,null,"18.    This Agreement does not create or imply any relationship in agency or partnership between the Vendor and the Licensee."]
[null,null,null,"19.    Headings are inserted for the convenience of the parties only and are not to be considered when interpreting this Agreement. Words in the singular mean and include the plural and vice versa. Words in the masculine gender include the feminine gender and vice versa. Words in the neuter gender include the masculine gender and the feminine gender and vice versa."]
[null,null,null,"20.    If any term, covenant, condition or provision of this Agreement is held by a court of competent jurisdiction to be invalid, void or unenforceable, it is the parties' intent that such provision be reduced in scope by the court only to the extent deemed necessary by that court to render the provision reasonable and enforceable and the remainder of the provisions of this Agreement will in no way be affected, impaired or invalidated as a result."]
[null,null,null,"21.    This Agreement contains the entire agreement between the parties. All understandings have been included in this Agreement. Representations which may have been made by any party to this Agreement may in some way be inconsistent with this final written Agreement. All such statements are declared to be of no value in this Agreement. Only the written terms of this Agreement will bind the parties."]
[null,null,null,"22.    This Agreement and the terms and conditions contained in this Agreement apply to and are binding upon the Vendor's successors and assigns."]
[null,null,null,"Notices"]
[null,null,null,"23.    All notices to the Vendor under this Agreement are to be provided at the following address:"]
[null,null,null,"RCUBE Solutions: info@rcubesolutions.ca"]
[]
[null,null,"If you Agree with all this User Agreement and confirm you meet all the minimum system requirements, please type your full name below and CLICK \"I Accept\"\nOtherwise (either your don’t agree or don’t meet the minimum requirements), please CLICK \"I Don't Accept\".\n If this is the case, unfortunately you wont be able to use The \"Employee Clock-in\" Excel Software"]
[]
[{"$f":"IF(C48=\"\",\"no\",\"ok\")","v":"no"}]
[null,null,"Full Name"]
["User Name"]
["PC Name"]
["Date"]

{"sheet":"Registration","index":2,"n_rows":24,"n_cols":6,"rows_kept":24,"cut":false,"hidden":false,"merged":[]}
[]
["Field check",{"$f":"IF(B3=\"N\",IF(A12>0,\"No\",\"OK\"),\"NO\")","v":"No"}]
["Registered","N",null,null,null,"LICENSE REGISTRATION"]
["Overall Trial",{"$f":"Admin_License!K15","v":"OK"}]
[]
[null,null,null,null,null,"1) To REGISTER your License, please fill the fields below."]
[null,null,null,null,null,"2) When you click \"REGISTER\", a  \"csv\" file will be saved in your desktop under the name of \"License_Registration_Checkin.csv\""]
[null,null,null,null,null,"3) Please send that file to registration@rcubesolutions.ca"]
[null,null,null,null,null,"4) You will then a get an email confirming your registration (could take 24-48 hours)"]
[]
[null,null,null,null,null,"Please fill all mandatory Fields (*). Ensure is accurate data"]
[{"$f":"SUM(A14:A23)","v":7}]
[null,null,null,null,"License #",{"$f":"IF(B2=\"No\",\"\",Admin_License!P32)","v":""}]
[{"$f":"IF(F14=\"\",1,0)","v":1},null,null,null,"* Full Name"]
[{"$f":"IF(F15=\"\",1,0)","v":1},null,null,null," * Company Name"]
[{"$f":"IF(F16=\"\",1,0)","v":1},null,null,null,"* Email"]
[{"$f":"IF(F17=\"\",1,0)","v":1},null,null,null,"* Phone #"]
[null,null,null,null,"Address 1"]
[null,null,null,null,"Address 2"]
[{"$f":"IF(F20=\"\",1,0)","v":1},null,null,null,"* City"]
[{"$f":"IF(F21=\"\",1,0)","v":1},null,null,null,"* Province / State"]
[null,null,null,null,"Postal Code"]
[{"$f":"IF(F23=\"\",1,0)","v":1},null,null,null,"* Country (use drop down)"]
[null,null,null,null,"Parent License","This field is only if someone had purchased multiple seats. Enter then the \"Parent\" License"]

{"sheet":"Home","index":3,"n_rows":29,"n_cols":17,"rows_kept":29,"cut":false,"hidden":false,"merged":[[28,2,29,11]]}
[]
[]
[]
[]
[]
[]
[]
[null,null,"Employee Clock-in Platform",null,null,null,null,null,null,null,"version 3.3"]
[]
[]
[]
[null,null,"STAFF",null,null,null,"MANAGERS",null,null,null,null,null,"SUPPORT"]
[]
[null,null,null,null,null,null,null,null,null,null,null,null,null,null,null,{"$f":"Staff!I12","v":"password"},{"$f":"IF(P14=Login!C15,\"OK\",\"NO\")","v":"NO"}]
[]
[]
[]
[]
[]
[]
[]
[]
[]
[]
[]
[]
[]
[]
[null,null,{"$f":"IF(Admin_License!AJ2=\"\",\"\",Admin_License!AJ2)","v":""}]

{"sheet":"Login","index":4,"n_rows":39,"n_cols":31,"rows_kept":39,"cut":false,"hidden":false,"merged":[]}
[null,null,null,null,null,null,null,null,null,null,null,null,{"$f":"\"Staff!D11:D\"&Staff!D1","v":"Staff!D11:D12"}]
[]
[]
[]
[]
[]
[]
[]
[]
[null,{"$f":"TODAY()","v":"2017-11-26"}]
[null,null,null,null,null,null,null,null,null,null,null,"Staff Name:","Rey"]
[]
["Name","Date","Time","Log","Ref","Count","IN","Out","Check"]
[{"$f":"List_Staff_login","v":"Rey"},{"$f":"TODAY()","v":"2017-11-26"},{"$f":"NOW()","v":"2017-11-26T23:18:56.240"},null,{"$f":"MATCH(F14&A14&B14,Data!D:D,0)","v":{"$error":"#N/A"}},{"$f":"COUNTIFS(Data!T:T,Login!A14,Data!U:U,Login!B14)","v":0},{"$f":"COUNTIFS(Data!T:T,Login!A14,Data!U:U,Login!B14,Data!W:W,Login!$G$13)","v":0},{"$f":"COUNTIFS(Data!T:T,Login!A14,Data!U:U,Login!B14,Data!X:X,\">0\")","v":0},{"$f":"IF(G14=H14,\"IN\",\"OUT\")","v":"IN"}]
["Pass",{"$f":"IFERROR(VLOOKUP(A14,Staff!D:L,6,FALSE),\"\")","v":""},"xx",{"$f":"IF(C15=\"\",\"NO\",IF(C15=B15,\"OK\",\"NO\"))","v":"NO"},null,null,null,null,null,null,null,null,null,"Time IN","Time OUT","Time IN","Time OUT","Time IN","Time OUT","Time IN","Time OUT"]
["Pay period",{"$f":"VLOOKUP(B14,Admin!C:I,5)","v":"16-Nov/30-Nov"},null,null,null,null,null,null,null,null,null,null,{"$f":"VLOOKUP($M$17,Admin!$G:$I,2,FALSE)","v":"2017-10-01"},1,1,2,2,3,3,4,4]
["days period",{"$f":"VLOOKUP($M$17,Admin!$G:$I,3,FALSE)","v":15},null,null,null,null,null,null,null,null,null,"Select Pay Period:","1-Oct/15-Oct",null,null,null,null,null,null,null,null,"Total",{"$f":"SUM(W20:W39)","v":0}]
[]
["IN","OUT","IN","OUT","IN","OUT","IN","OUT","Day","count",null,null,"Date","IN","OUT","IN","OUT","IN","OUT","IN","OUT",null,"Hours Worked",null,"Shift 1",null,"Shift 1",null,"Shift 1",null,"Shift 1"]
[null,{"$f":"IF(AND(N20<>\"\",O20=\"\"),1,0)","v":0},null,{"$f":"IF(AND(P20<>\"\",Q20=\"\"),1,0)","v":0},null,{"$f":"IF(AND(R20<>\"\",S20=\"\"),1,0)","v":0},null,{"$f":"IF(AND(T20<>\"\",U20=\"\"),1,0)","v":0},{"$f":"M16","v":"2017-10-01"},1,null,null,{"$f":"IF($D$15=\"OK\",I20,\"\")","v":""},{"$f":"IFERROR(IF(VLOOKUP(N$16&$M$11&$M20,Data!$D:$X,MATCH(Login!N$15,Data!$D$4:$X$4,0),FALSE)=0,\"\",VLOOKUP(N$16&$M$11&$M20,Data!$D:$X,MATCH(Login!N$15,Data!$D$4:$X$4,0),FALSE)),\"\")","v":""},{"$f":"IFERROR(IF(VLOOKUP(O$16&$M$11&$M20,Data!$D:$X,MATCH(Login!O$15,Data!$D$4:$X$4,0),FALSE)=0,\"\",VLOOKUP(O$16&$M$11&$M20,Data!$D:$X,MATCH(Login!O$15,Data!$D$4:$X$4,0),FALSE)),\"\")","v":""},{"$f":"IFERROR(IF(VLOOKUP(P$16&$M$11&$M20,Data!$D:$X,MATCH(Login!P$15,Data!$D$4:$X$4,0),FALSE)=0,\"\",VLOOKUP(P$16&$M$11&$M20,Data!$D:$X,MATCH(Login!P$15,Data!$D$4:$X$4,0),FALSE)),\"\")","v":""},{"$f":"IFERROR(IF(VLOOKUP(Q$16&$M$11&$M20,Data!$D:$X,MATCH(Login!Q$15,Data!$D$4:$X$4,0),FALSE)=0,\"\",VLOOKUP(Q$16&$M$11&$M20,Data!$D:$X,MATCH(Login!Q$15,Data!$D$4:$X$4,0),FALSE)),\"\")","v":""},{"$f":"IFERROR(IF(VLOOKUP(R$16&$M$11&$M20,Data!$D:$X,MATCH(Login!R$15,Data!$D$4:$X$4,0),FALSE)=0,\"\",VLOOKUP(R$16&$M$11&$M20,Data!$D:$X,MATCH(Login!R$15,Data!$D$4:$X$4,0),FALSE)),\"\")","v":""},{"$f":"IFERROR(IF(VLOOKUP(S$16&$M$11&$M20,Data!$D:$X,MATCH(Login!S$15,Data!$D$4:$X$4,0),FALSE)=0,\"\",VLOOKUP(S$16&$M$11&$M20,Data!$D:$X,MATCH(Login!S$15,Data!$D$4:$X$4,0),FALSE)),\"\")","v":""},{"$f":"IFERROR(IF(VLOOKUP(T$16&$M$11&$M20,Data!$D:$X,MATCH(Login!T$15,Data!$D$4:$X$4,0),FALSE)=0,\"\",VLOOKUP(T$16&$M$11&$M20,Data!$D:$X,MATCH(Login!T$15,Data!$D$4:$X$4,0),FALSE)),\"\")","v":""},{"$f":"IFERROR(IF(VLOOKUP(U$16&$M$11&$M20,Data!$D:$X,MATCH(Login!U$15,Data!$D$4:$X$4,0),FALSE)=0,\"\",VLOOKUP(U$16&$M$11&$M20,Data!$D:$X,MATCH(Login!U$15,Data!$D$4:$X$4,0),FALSE)),\"\")","v":""},null,{"$f":"IF(SUM(Y20:AE20)=0,\"\",SUM(Y20:AE20))","v":""},null,{"$f":"(IFERROR(IF(B20=1,0,O20-N20),0)*86400/60/60)","v":0},null,0,null,0,null,0]
[null,{"$f":"IF(AND(N21<>\"\",O21=\"\"),1,0)","v":0},null,{"$f":"IF(AND(P21<>\"\",Q21=\"\"),1,0)","v":0},null,{"$f":"IF(AND(R21<>\"\",S21=\"\"),1,0)","v":0},null,{"$f":"IF(AND(T21<>\"\",U21=\"\"),1,0)","v":0},{"$f":"IF(J21>$B$17,\"\",I20+1)","v":"2017-10-02"},2,null,null,{"$f":"IF($D$15=\"OK\",I21,\"\")","v":""},{"$f":"IFERROR(IF(VLOOKUP(N$16&$M$11&$M21,Data!$D:$X,MATCH(Login!N$15,Data!$D$4:$X$4,0),FALSE)=0,\"\",VLOOKUP(N$16&$M$11&$M21,Data!$D:$X,MATCH(Login!N$15,Data!$D$4:$X$4,0),FALSE)),\"\")","v":""},{"$f":"IFERROR(IF(VLOOKUP(O$16&$M$11&$M21,Data!$D:$X,MATCH(Login!O$15,Data!$D$4:$X$4,0),FALSE)=0,\"\",VLOOKUP(O$16&$M$11&$M21,Data!$D:$X,MATCH(Login!O$15,Data!$D$4:$X$4,0),FALSE)),\"\")","v":""},{"$f":"IFERROR(IF(VLOOKUP(P$16&$M$11&$M21,Data!$D:$X,MATCH(Login!P$15,Data!$D$4:$X$4,0),FALSE)=0,\"\",VLOOKUP(P$16&$M$11&$M21,Data!$D:$X,MATCH(Login!P$15,Data!$D$4:$X$4,0),FALSE)),\"\")","v":""},{"$f":"IFERROR(IF(VLOOKUP(Q$16&$M$11&$M21,Data!$D:$X,MATCH(Login!Q$15,Data!$D$4:$X$4,0),FALSE)=0,\"\",VLOOKUP(Q$16&$M$11&$M21,Data!$D:$X,MATCH(Login!Q$15,Data!$D$4:$X$4,0),FALSE)),\"\")","v":""},{"$f":"IFERROR(IF(VLOOKUP(R$16&$M$11&$M21,Data!$D:$X,MATCH(Login!R$15,Data!$D$4:$X$4,0),FALSE)=0,\"\",VLOOKUP(R$16&$M$11&$M21,Data!$D:$X,MATCH(Login!R$15,Data!$D$4:$X$4,0),FALSE)),\"\")","v":""},{"$f":"IFERROR(IF(VLOOKUP(S$16&$M$11&$M21,Data!$D:$X,MATCH(Login!S$15,Data!$D$4:$X$4,0),FALSE)=0,\"\",VLOOKUP(S$16&$M$11&$M21,Data!$D:$X,MATCH(Login!S$15,Data!$D$4:$X$4,0),FALSE)),\"\")","v":""},{"$f":"IFERROR(IF(VLOOKUP(T$16&$M$11&$M21,Data!$D:$X,MATCH(Login!T$15,Data!$D$4:$X$4,0),FALSE)=0,\"\",VLOOKUP(T$16&$M$11&$M21,Data!$D:$X,MATCH(Login!T$15,Data!$D$4:$X$4,0),FALSE)),\"\")","v":""},{"$f":"IFERROR(IF(VLOOKUP(U$16&$M$11&$M21,Data!$D:$X,MATCH(Login!U$15,Data!$D$4:$X$4,0),FALSE)=0,\"\",VLOOKUP(U$16&$M$11&$M21,Data!$D:$X,MATCH(Login!U$15,Data!$D$4:$X$4,0),FALSE)),\"\")","v":""},null,{"$f":"IF(SUM(Y21:AE21)=0,\"\",SUM(Y21:AE21))","v":""},null,0,null,0,null,0,null,0]
[null,0,null,0,null,0,null,0,{"$f":"IF(J22>$B$17,\"\",I21+1)","v":"2017-10-03"},3,null,null,"",{"$f":"IFERROR(IF(VLOOKUP(N$16&$M$11&$M22,Data!$D:$X,MATCH(Login!N$15,Data!$D$4:$X$4,0),FALSE)=0,\"\",VLOOKUP(N$16&$M$11&$M22,Data!$D:$X,MATCH(Login!N$15,Data!$D$4:$X$4,0),FALSE)),\"\")","v":""},{"$f":"IFERROR(IF(VLOOKUP(O$16&$M$11&$M22,Data!$D:$X,MATCH(Login!O$15,Data!$D$4:$X$4,0),FALSE)=0,\"\",VLOOKUP(O$16&$M$11&$M22,Data!$D:$X,MATCH(Login!O$15,Data!$D$4:$X$4,0),FALSE)),\"\")","v":""},{"$f":"IFERROR(IF(VLOOKUP(P$16&$M$11&$M22,Data!$D:$X,MATCH(Login!P$15,Data!$D$4:$X$4,0),FALSE)=0,\"\",VLOOKUP(P$16&$M$11&$M22,Data!$D:$X,MATCH(Login!P$15,Data!$D$4:$X$4,0),FALSE)),\"\")","v":""},{"$f":"IFERROR(IF(VLOOKUP(Q$16&$M$11&$M22,Data!$D:$X,MATCH(Login!Q$15,Data!$D$4:$X$4,0),FALSE)=0,\"\",VLOOKUP(Q$16&$M$11&$M22,Data!$D:$X,MATCH(Login!Q$15,Data!$D$4:$X$4,0),FALSE)),\"\")","v":""},{"$f":"IFERROR(IF(VLOOKUP(R$16&$M$11&$M22,Data!$D:$X,MATCH(Login!R$15,Data!$D$4:$X$4,0),FALSE)=0,\"\",VLOOKUP(R$16&$M$11&$M22,Data!$D:$X,MATCH(Login!R$15,Data!$D$4:$X$4,0),FALSE)),\"\")","v":""},{"$f":"IFERROR(IF(VLOOKUP(S$16&$M$11&$M22,Data!$D:$X,MATCH(Login!S$15,Data!$D$4:$X$4,0),FALSE)=0,\"\",VLOOKUP(S$16&$M$11&$M22,Data!$D:$X,MATCH(Login!S$15,Data!$D$4:$X$4,0),FALSE)),\"\")","v":""},{"$f":"IFERROR(IF(VLOOKUP(T$16&$M$11&$M22,Data!$D:$X,MATCH(Login!T$15,Data!$D$4:$X$4,0),FALSE)=0,\"\",VLOOKUP(T$16&$M$11&$M22,Data!$D:$X,MATCH(Login!T$15,Data!$D$4:$X$4,0),FALSE)),\"\")","v":""},{"$f":"IFERROR(IF(VLOOKUP(U$16&$M$11&$M22,Data!$D:$X,MATCH(Login!U$15,Data!$D$4:$X$4,0),FALSE)=0,\"\",VLOOKUP(U$16&$M$11&$M22,Data!$D:$X,MATCH(Login!U$15,Data!$D$4:$X$4,0),FALSE)),\"\")","v":""},null,"",null,0,null,0,null,0,null,0]
[null,0,null,0,null,0,null,0,"2017-10-04",4,null,null,"",{"$f":"IFERROR(IF(VLOOKUP(N$16&$M$11&$M23,Data!$D:$X,MATCH(Login!N$15,Data!$D$4:$X$4,0),FALSE)=0,\"\",VLOOKUP(N$16&$M$11&$M23,Data!$D:$X,MATCH(Login!N$15,Data!$D$4:$X$4,0),FALSE)),\"\")","v":""},{"$f":"IFERROR(IF(VLOOKUP(O$16&$M$11&$M23,Data!$D:$X,MATCH(Login!O$15,Data!$D$4:$X$4,0),FALSE)=0,\"\",VLOOKUP(O$16&$M$11&$M23,Data!$D:$X,MATCH(Login!O$15,Data!$D$4:$X$4,0),FALSE)),\"\")","v":""},{"$f":"IFERROR(IF(VLOOKUP(P$16&$M$11&$M23,Data!$D:$X,MATCH(Login!P$15,Data!$D$4:$X$4,0),FALSE)=0,\"\",VLOOKUP(P$16&$M$11&$M23,Data!$D:$X,MATCH(Login!P$15,Data!$D$4:$X$4,0),FALSE)),\"\")","v":""},{"$f":"IFERROR(IF(VLOOKUP(Q$16&$M$11&$M23,Data!$D:$X,MATCH(Login!Q$15,Data!$D$4:$X$4,0),FALSE)=0,\"\",VLOOKUP(Q$16&$M$11&$M23,Data!$D:$X,MATCH(Login!Q$15,Data!$D$4:$X$4,0),FALSE)),\"\")","v":""},{"$f":"IFERROR(IF(VLOOKUP(R$16&$M$11&$M23,Data!$D:$X,MATCH(Login!R$15,Data!$D$4:$X$4,0),FALSE)=0,\"\",VLOOKUP(R$16&$M$11&$M23,Data!$D:$X,MATCH(Login!R$15,Data!$D$4:$X$4,0),FALSE)),\"\")","v":""},{"$f":"IFERROR(IF(VLOOKUP(S$16&$M$11&$M23,Data!$D:$X,MATCH(Login!S$15,Data!$D$4:$X$4,0),FALSE)=0,\"\",VLOOKUP(S$16&$M$11&$M23,Data!$D:$X,MATCH(Login!S$15,Data!$D$4:$X$4,0),FALSE)),\"\")","v":""},{"$f":"IFERROR(IF(VLOOKUP(T$16&$M$11&$M23,Data!$D:$X,MATCH(Login!T$15,Data!$D$4:$X$4,0),FALSE)=0,\"\",VLOOKUP(T$16&$M$11&$M23,Data!$D:$X,MATCH(Login!T$15,Data!$D$4:$X$4,0),FALSE)),\"\")","v":""},{"$f":"IFERROR(IF(VLOOKUP(U$16&$M$11&$M23,Data!$D:$X,MATCH(Login!U$15,Data!$D$4:$X$4,0),FALSE)=0,\"\",VLOOKUP(U$16&$M$11&$M23,Data!$D:$X,MATCH(Login!U$15,Data!$D$4:$X$4,0),FALSE)),\"\")","v":""},null,"",null,0,null,0,null,0,null,0]
[null,0,null,0,null,0,null,0,"2017-10-05",5,null,null,"",{"$f":"IFERROR(IF(VLOOKUP(N$16&$M$11&$M24,Data!$D:$X,MATCH(Login!N$15,Data!$D$4:$X$4,0),FALSE)=0,\"\",VLOOKUP(N$16&$M$11&$M24,Data!$D:$X,MATCH(Login!N$15,Data!$D$4:$X$4,0),FALSE)),\"\")","v":""},{"$f":"IFERROR(IF(VLOOKUP(O$16&$M$11&$M24,Data!$D:$X,MATCH(Login!O$15,Data!$D$4:$X$4,0),FALSE)=0,\"\",VLOOKUP(O$16&$M$11&$M24,Data!$D:$X,MATCH(Login!O$15,Data!$D$4:$X$4,0),FALSE)),\"\")","v":""},{"$f":"IFERROR(IF(VLOOKUP(P$16&$M$11&$M24,Data!$D:$X,MATCH(Login!P$15,Data!$D$4:$X$4,0),FALSE)=0,\"\",VLOOKUP(P$16&$M$11&$M24,Data!$D:$X,MATCH(Login!P$15,Data!$D$4:$X$4,0),FALSE)),\"\")","v":""},{"$f":"IFERROR(IF(VLOOKUP(Q$16&$M$11&$M24,Data!$D:$X,MATCH(Login!Q$15,Data!$D$4:$X$4,0),FALSE)=0,\"\",VLOOKUP(Q$16&$M$11&$M24,Data!$D:$X,MATCH(Login!Q$15,Data!$D$4:$X$4,0),FALSE)),\"\")","v":""},{"$f":"IFERROR(IF(VLOOKUP(R$16&$M$11&$M24,Data!$D:$X,MATCH(Login!R$15,Data!$D$4:$X$4,0),FALSE)=0,\"\",VLOOKUP(R$16&$M$11&$M24,Data!$D:$X,MATCH(Login!R$15,Data!$D$4:$X$4,0),FALSE)),\"\")","v":""},{"$f":"IFERROR(IF(VLOOKUP(S$16&$M$11&$M24,Data!$D:$X,MATCH(Login!S$15,Data!$D$4:$X$4,0),FALSE)=0,\"\",VLOOKUP(S$16&$M$11&$M24,Data!$D:$X,MATCH(Login!S$15,Data!$D$4:$X$4,0),FALSE)),\"\")","v":""},{"$f":"IFERROR(IF(VLOOKUP(T$16&$M$11&$M24,Data!$D:$X,MATCH(Login!T$15,Data!$D$4:$X$4,0),FALSE)=0,\"\",VLOOKUP(T$16&$M$11&$M24,Data!$D:$X,MATCH(Login!T$15,Data!$D$4:$X$4,0),FALSE)),\"\")","v":""},{"$f":"IFERROR(IF(VLOOKUP(U$16&$M$11&$M24,Data!$D:$X,MATCH(Login!U$15,Data!$D$4:$X$4,0),FALSE)=0,\"\",VLOOKUP(U$16&$M$11&$M24,Data!$D:$X,MATCH(Login!U$15,Data!$D$4:$X$4,0),FALSE)),\"\")","v":""},null,"",null,0,null,0,null,0,null,0]
[null,0,null,0,null,0,null,0,"2017-10-06",6,null,null,"",{"$f":"IFERROR(IF(VLOOKUP(N$16&$M$11&$M25,Data!$D:$X,MATCH(Login!N$15,Data!$D$4:$X$4,0),FALSE)=0,\"\",VLOOKUP(N$16&$M$11&$M25,Data!$D:$X,MATCH(Login!N$15,Data!$D$4:$X$4,0),FALSE)),\"\")","v":""},{"$f":"IFERROR(IF(VLOOKUP(O$16&$M$11&$M25,Data!$D:$X,MATCH(Login!O$15,Data!$D$4:$X$4,0),FALSE)=0,\"\",VLOOKUP(O$16&$M$11&$M25,Data!$D:$X,MATCH(Login!O$15,Data!$D$4:$X$4,0),FALSE)),\"\")","v":""},{"$f":"IFERROR(IF(VLOOKUP(P$16&$M$11&$M25,Data!$D:$X,MATCH(Login!P$15,Data!$D$4:$X$4,0),FALSE)=0,\"\",VLOOKUP(P$16&$M$11&$M25,Data!$D:$X,MATCH(Login!P$15,Data!$D$4:$X$4,0),FALSE)),\"\")","v":""},{"$f":"IFERROR(IF(VLOOKUP(Q$16&$M$11&$M25,Data!$D:$X,MATCH(Login!Q$15,Data!$D$4:$X$4,0),FALSE)=0,\"\",VLOOKUP(Q$16&$M$11&$M25,Data!$D:$X,MATCH(Login!Q$15,Data!$D$4:$X$4,0),FALSE)),\"\")","v":""},{"$f":"IFERROR(IF(VLOOKUP(R$16&$M$11&$M25,Data!$D:$X,MATCH(Login!R$15,Data!$D$4:$X$4,0),FALSE)=0,\"\",VLOOKUP(R$16&$M$11&$M25,Data!$D:$X,MATCH(Login!R$15,Data!$D$4:$X$4,0),FALSE)),\"\")","v":""},{"$f":"IFERROR(IF(VLOOKUP(S$16&$M$11&$M25,Data!$D:$X,MATCH(Login!S$15,Data!$D$4:$X$4,0),FALSE)=0,\"\",VLOOKUP(S$16&$M$11&$M25,Data!$D:$X,MATCH(Login!S$15,Data!$D$4:$X$4,0),FALSE)),\"\")","v":""},{"$f":"IFERROR(IF(VLOOKUP(T$16&$M$11&$M25,Data!$D:$X,MATCH(Login!T$15,Data!$D$4:$X$4,0),FALSE)=0,\"\",VLOOKUP(T$16&$M$11&$M25,Data!$D:$X,MATCH(Login!T$15,Data!$D$4:$X$4,0),FALSE)),\"\")","v":""},{"$f":"IFERROR(IF(VLOOKUP(U$16&$M$11&$M25,Data!$D:$X,MATCH(Login!U$15,Data!$D$4:$X$4,0),FALSE)=0,\"\",VLOOKUP(U$16&$M$11&$M25,Data!$D:$X,MATCH(Login!U$15,Data!$D$4:$X$4,0),FALSE)),\"\")","v":""},null,"",null,0,null,0,null,0,null,0]
[null,0,null,0,null,0,null,0,"2017-10-07",7,null,null,"",{"$f":"IFERROR(IF(VLOOKUP(N$16&$M$11&$M26,Data!$D:$X,MATCH(Login!N$15,Data!$D$4:$X$4,0),FALSE)=0,\"\",VLOOKUP(N$16&$M$11&$M26,Data!$D:$X,MATCH(Login!N$15,Data!$D$4:$X$4,0),FALSE)),\"\")","v":""},{"$f":"IFERROR(IF(VLOOKUP(O$16&$M$11&$M26,Data!$D:$X,MATCH(Login!O$15,Data!$D$4:$X$4,0),FALSE)=0,\"\",VLOOKUP(O$16&$M$11&$M26,Data!$D:$X,MATCH(Login!O$15,Data!$D$4:$X$4,0),FALSE)),\"\")","v":""},{"$f":"IFERROR(IF(VLOOKUP(P$16&$M$11&$M26,Data!$D:$X,MATCH(Login!P$15,Data!$D$4:$X$4,0),FALSE)=0,\"\",VLOOKUP(P$16&$M$11&$M26,Data!$D:$X,MATCH(Login!P$15,Data!$D$4:$X$4,0),FALSE)),\"\")","v":""},{"$f":"IFERROR(IF(VLOOKUP(Q$16&$M$11&$M26,Data!$D:$X,MATCH(Login!Q$15,Data!$D$4:$X$4,0),FALSE)=0,\"\",VLOOKUP(Q$16&$M$11&$M26,Data!$D:$X,MATCH(Login!Q$15,Data!$D$4:$X$4,0),FALSE)),\"\")","v":""},{"$f":"IFERROR(IF(VLOOKUP(R$16&$M$11&$M26,Data!$D:$X,MATCH(Login!R$15,Data!$D$4:$X$4,0),FALSE)=0,\"\",VLOOKUP(R$16&$M$11&$M26,Data!$D:$X,MATCH(Login!R$15,Data!$D$4:$X$4,0),FALSE)),\"\")","v":""},{"$f":"IFERROR(IF(VLOOKUP(S$16&$M$11&$M26,Data!$D:$X,MATCH(Login!S$15,Data!$D$4:$X$4,0),FALSE)=0,\"\",VLOOKUP(S$16&$M$11&$M26,Data!$D:$X,MATCH(Login!S$15,Data!$D$4:$X$4,0),FALSE)),\"\")","v":""},{"$f":"IFERROR(IF(VLOOKUP(T$16&$M$11&$M26,Data!$D:$X,MATCH(Login!T$15,Data!$D$4:$X$4,0),FALSE)=0,\"\",VLOOKUP(T$16&$M$11&$M26,Data!$D:$X,MATCH(Login!T$15,Data!$D$4:$X$4,0),FALSE)),\"\")","v":""},{"$f":"IFERROR(IF(VLOOKUP(U$16&$M$11&$M26,Data!$D:$X,MATCH(Login!U$15,Data!$D$4:$X$4,0),FALSE)=0,\"\",VLOOKUP(U$16&$M$11&$M26,Data!$D:$X,MATCH(Login!U$15,Data!$D$4:$X$4,0),FALSE)),\"\")","v":""},null,"",null,0,null,0,null,0,null,0]
[null,0,null,0,null,0,null,0,"2017-10-08",8,null,null,"",{"$f":"IFERROR(IF(VLOOKUP(N$16&$M$11&$M27,Data!$D:$X,MATCH(Login!N$15,Data!$D$4:$X$4,0),FALSE)=0,\"\",VLOOKUP(N$16&$M$11&$M27,Data!$D:$X,MATCH(Login!N$15,Data!$D$4:$X$4,0),FALSE)),\"\")","v":""},{"$f":"IFERROR(IF(VLOOKUP(O$16&$M$11&$M27,Data!$D:$X,MATCH(Login!O$15,Data!$D$4:$X$4,0),FALSE)=0,\"\",VLOOKUP(O$16&$M$11&$M27,Data!$D:$X,MATCH(Login!O$15,Data!$D$4:$X$4,0),FALSE)),\"\")","v":""},{"$f":"IFERROR(IF(VLOOKUP(P$16&$M$11&$M27,Data!$D:$X,MATCH(Login!P$15,Data!$D$4:$X$4,0),FALSE)=0,\"\",VLOOKUP(P$16&$M$11&$M27,Data!$D:$X,MATCH(Login!P$15,Data!$D$4:$X$4,0),FALSE)),\"\")","v":""},{"$f":"IFERROR(IF(VLOOKUP(Q$16&$M$11&$M27,Data!$D:$X,MATCH(Login!Q$15,Data!$D$4:$X$4,0),FALSE)=0,\"\",VLOOKUP(Q$16&$M$11&$M27,Data!$D:$X,MATCH(Login!Q$15,Data!$D$4:$X$4,0),FALSE)),\"\")","v":""},{"$f":"IFERROR(IF(VLOOKUP(R$16&$M$11&$M27,Data!$D:$X,MATCH(Login!R$15,Data!$D$4:$X$4,0),FALSE)=0,\"\",VLOOKUP(R$16&$M$11&$M27,Data!$D:$X,MATCH(Login!R$15,Data!$D$4:$X$4,0),FALSE)),\"\")","v":""},{"$f":"IFERROR(IF(VLOOKUP(S$16&$M$11&$M27,Data!$D:$X,MATCH(Login!S$15,Data!$D$4:$X$4,0),FALSE)=0,\"\",VLOOKUP(S$16&$M$11&$M27,Data!$D:$X,MATCH(Login!S$15,Data!$D$4:$X$4,0),FALSE)),\"\")","v":""},{"$f":"IFERROR(IF(VLOOKUP(T$16&$M$11&$M27,Data!$D:$X,MATCH(Login!T$15,Data!$D$4:$X$4,0),FALSE)=0,\"\",VLOOKUP(T$16&$M$11&$M27,Data!$D:$X,MATCH(Login!T$15,Data!$D$4:$X$4,0),FALSE)),\"\")","v":""},{"$f":"IFERROR(IF(VLOOKUP(U$16&$M$11&$M27,Data!$D:$X,MATCH(Login!U$15,Data!$D$4:$X$4,0),FALSE)=0,\"\",VLOOKUP(U$16&$M$11&$M27,Data!$D:$X,MATCH(Login!U$15,Data!$D$4:$X$4,0),FALSE)),\"\")","v":""},null,"",null,0,null,0,null,0,null,0]
[null,0,null,0,null,0,null,0,"2017-10-09",9,null,null,"",{"$f":"IFERROR(IF(VLOOKUP(N$16&$M$11&$M28,Data!$D:$X,MATCH(Login!N$15,Data!$D$4:$X$4,0),FALSE)=0,\"\",VLOOKUP(N$16&$M$11&$M28,Data!$D:$X,MATCH(Login!N$15,Data!$D$4:$X$4,0),FALSE)),\"\")","v":""},{"$f":"IFERROR(IF(VLOOKUP(O$16&$M$11&$M28,Data!$D:$X,MATCH(Login!O$15,Data!$D$4:$X$4,0),FALSE)=0,\"\",VLOOKUP(O$16&$M$11&$M28,Data!$D:$X,MATCH(Login!O$15,Data!$D$4:$X$4,0),FALSE)),\"\")","v":""},{"$f":"IFERROR(IF(VLOOKUP(P$16&$M$11&$M28,Data!$D:$X,MATCH(Login!P$15,Data!$D$4:$X$4,0),FALSE)=0,\"\",VLOOKUP(P$16&$M$11&$M28,Data!$D:$X,MATCH(Login!P$15,Data!$D$4:$X$4,0),FALSE)),\"\")","v":""},{"$f":"IFERROR(IF(VLOOKUP(Q$16&$M$11&$M28,Data!$D:$X,MATCH(Login!Q$15,Data!$D$4:$X$4,0),FALSE)=0,\"\",VLOOKUP(Q$16&$M$11&$M28,Data!$D:$X,MATCH(Login!Q$15,Data!$D$4:$X$4,0),FALSE)),\"\")","v":""},{"$f":"IFERROR(IF(VLOOKUP(R$16&$M$11&$M28,Data!$D:$X,MATCH(Login!R$15,Data!$D$4:$X$4,0),FALSE)=0,\"\",VLOOKUP(R$16&$M$11&$M28,Data!$D:$X,MATCH(Login!R$15,Data!$D$4:$X$4,0),FALSE)),\"\")","v":""},{"$f":"IFERROR(IF(VLOOKUP(S$16&$M$11&$M28,Data!$D:$X,MATCH(Login!S$15,Data!$D$4:$X$4,0),FALSE)=0,\"\",VLOOKUP(S$16&$M$11&$M28,Data!$D:$X,MATCH(Login!S$15,Data!$D$4:$X$4,0),FALSE)),\"\")","v":""},{"$f":"IFERROR(IF(VLOOKUP(T$16&$M$11&$M28,Data!$D:$X,MATCH(Login!T$15,Data!$D$4:$X$4,0),FALSE)=0,\"\",VLOOKUP(T$16&$M$11&$M28,Data!$D:$X,MATCH(Login!T$15,Data!$D$4:$X$4,0),FALSE)),\"\")","v":""},{"$f":"IFERROR(IF(VLOOKUP(U$16&$M$11&$M28,Data!$D:$X,MATCH(Login!U$15,Data!$D$4:$X$4,0),FALSE)=0,\"\",VLOOKUP(U$16&$M$11&$M28,Data!$D:$X,MATCH(Login!U$15,Data!$D$4:$X$4,0),FALSE)),\"\")","v":""},null,"",null,0,null,0,null,0,null,0]
[null,0,null,0,null,0,null,0,"2017-10-10",10,null,null,"",{"$f":"IFERROR(IF(VLOOKUP(N$16&$M$11&$M29,Data!$D:$X,MATCH(Login!N$15,Data!$D$4:$X$4,0),FALSE)=0,\"\",VLOOKUP(N$16&$M$11&$M29,Data!$D:$X,MATCH(Login!N$15,Data!$D$4:$X$4,0),FALSE)),\"\")","v":""},{"$f":"IFERROR(IF(VLOOKUP(O$16&$M$11&$M29,Data!$D:$X,MATCH(Login!O$15,Data!$D$4:$X$4,0),FALSE)=0,\"\",VLOOKUP(O$16&$M$11&$M29,Data!$D:$X,MATCH(Login!O$15,Data!$D$4:$X$4,0),FALSE)),\"\")","v":""},{"$f":"IFERROR(IF(VLOOKUP(P$16&$M$11&$M29,Data!$D:$X,MATCH(Login!P$15,Data!$D$4:$X$4,0),FALSE)=0,\"\",VLOOKUP(P$16&$M$11&$M29,Data!$D:$X,MATCH(Login!P$15,Data!$D$4:$X$4,0),FALSE)),\"\")","v":""},{"$f":"IFERROR(IF(VLOOKUP(Q$16&$M$11&$M29,Data!$D:$X,MATCH(Login!Q$15,Data!$D$4:$X$4,0),FALSE)=0,\"\",VLOOKUP(Q$16&$M$11&$M29,Data!$D:$X,MATCH(Login!Q$15,Data!$D$4:$X$4,0),FALSE)),\"\")","v":""},{"$f":"IFERROR(IF(VLOOKUP(R$16&$M$11&$M29,Data!$D:$X,MATCH(Login!R$15,Data!$D$4:$X$4,0),FALSE)=0,\"\",VLOOKUP(R$16&$M$11&$M29,Data!$D:$X,MATCH(Login!R$15,Data!$D$4:$X$4,0),FALSE)),\"\")","v":""},{"$f":"IFERROR(IF(VLOOKUP(S$16&$M$11&$M29,Data!$D:$X,MATCH(Login!S$15,Data!$D$4:$X$4,0),FALSE)=0,\"\",VLOOKUP(S$16&$M$11&$M29,Data!$D:$X,MATCH(Login!S$15,Data!$D$4:$X$4,0),FALSE)),\"\")","v":""},{"$f":"IFERROR(IF(VLOOKUP(T$16&$M$11&$M29,Data!$D:$X,MATCH(Login!T$15,Data!$D$4:$X$4,0),FALSE)=0,\"\",VLOOKUP(T$16&$M$11&$M29,Data!$D:$X,MATCH(Login!T$15,Data!$D$4:$X$4,0),FALSE)),\"\")","v":""},{"$f":"IFERROR(IF(VLOOKUP(U$16&$M$11&$M29,Data!$D:$X,MATCH(Login!U$15,Data!$D$4:$X$4,0),FALSE)=0,\"\",VLOOKUP(U$16&$M$11&$M29,Data!$D:$X,MATCH(Login!U$15,Data!$D$4:$X$4,0),FALSE)),\"\")","v":""},null,"",null,0,null,0,null,0,null,0]
[null,0,null,0,null,0,null,0,"2017-10-11",11,null,null,"",{"$f":"IFERROR(IF(VLOOKUP(N$16&$M$11&$M30,Data!$D:$X,MATCH(Login!N$15,Data!$D$4:$X$4,0),FALSE)=0,\"\",VLOOKUP(N$16&$M$11&$M30,Data!$D:$X,MATCH(Login!N$15,Data!$D$4:$X$4,0),FALSE)),\"\")","v":""},{"$f":"IFERROR(IF(VLOOKUP(O$16&$M$11&$M30,Data!$D:$X,MATCH(Login!O$15,Data!$D$4:$X$4,0),FALSE)=0,\"\",VLOOKUP(O$16&$M$11&$M30,Data!$D:$X,MATCH(Login!O$15,Data!$D$4:$X$4,0),FALSE)),\"\")","v":""},{"$f":"IFERROR(IF(VLOOKUP(P$16&$M$11&$M30,Data!$D:$X,MATCH(Login!P$15,Data!$D$4:$X$4,0),FALSE)=0,\"\",VLOOKUP(P$16&$M$11&$M30,Data!$D:$X,MATCH(Login!P$15,Data!$D$4:$X$4,0),FALSE)),\"\")","v":""},{"$f":"IFERROR(IF(VLOOKUP(Q$16&$M$11&$M30,Data!$D:$X,MATCH(Login!Q$15,Data!$D$4:$X$4,0),FALSE)=0,\"\",VLOOKUP(Q$16&$M$11&$M30,Data!$D:$X,MATCH(Login!Q$15,Data!$D$4:$X$4,0),FALSE)),\"\")","v":""},{"$f":"IFERROR(IF(VLOOKUP(R$16&$M$11&$M30,Data!$D:$X,MATCH(Login!R$15,Data!$D$4:$X$4,0),FALSE)=0,\"\",VLOOKUP(R$16&$M$11&$M30,Data!$D:$X,MATCH(Login!R$15,Data!$D$4:$X$4,0),FALSE)),\"\")","v":""},{"$f":"IFERROR(IF(VLOOKUP(S$16&$M$11&$M30,Data!$D:$X,MATCH(Login!S$15,Data!$D$4:$X$4,0),FALSE)=0,\"\",VLOOKUP(S$16&$M$11&$M30,Data!$D:$X,MATCH(Login!S$15,Data!$D$4:$X$4,0),FALSE)),\"\")","v":""},{"$f":"IFERROR(IF(VLOOKUP(T$16&$M$11&$M30,Data!$D:$X,MATCH(Login!T$15,Data!$D$4:$X$4,0),FALSE)=0,\"\",VLOOKUP(T$16&$M$11&$M30,Data!$D:$X,MATCH(Login!T$15,Data!$D$4:$X$4,0),FALSE)),\"\")","v":""},{"$f":"IFERROR(IF(VLOOKUP(U$16&$M$11&$M30,Data!$D:$X,MATCH(Login!U$15,Data!$D$4:$X$4,0),FALSE)=0,\"\",VLOOKUP(U$16&$M$11&$M30,Data!$D:$X,MATCH(Login!U$15,Data!$D$4:$X$4,0),FALSE)),\"\")","v":""},null,"",null,0,null,0,null,0,null,0]
[null,0,null,0,null,0,null,0,"2017-10-12",12,null,null,"",{"$f":"IFERROR(IF(VLOOKUP(N$16&$M$11&$M31,Data!$D:$X,MATCH(Login!N$15,Data!$D$4:$X$4,0),FALSE)=0,\"\",VLOOKUP(N$16&$M$11&$M31,Data!$D:$X,MATCH(Login!N$15,Data!$D$4:$X$4,0),FALSE)),\"\")","v":""},{"$f":"IFERROR(IF(VLOOKUP(O$16&$M$11&$M31,Data!$D:$X,MATCH(Login!O$15,Data!$D$4:$X$4,0),FALSE)=0,\"\",VLOOKUP(O$16&$M$11&$M31,Data!$D:$X,MATCH(Login!O$15,Data!$D$4:$X$4,0),FALSE)),\"\")","v":""},{"$f":"IFERROR(IF(VLOOKUP(P$16&$M$11&$M31,Data!$D:$X,MATCH(Login!P$15,Data!$D$4:$X$4,0),FALSE)=0,\"\",VLOOKUP(P$16&$M$11&$M31,Data!$D:$X,MATCH(Login!P$15,Data!$D$4:$X$4,0),FALSE)),\"\")","v":""},{"$f":"IFERROR(IF(VLOOKUP(Q$16&$M$11&$M31,Data!$D:$X,MATCH(Login!Q$15,Data!$D$4:$X$4,0),FALSE)=0,\"\",VLOOKUP(Q$16&$M$11&$M31,Data!$D:$X,MATCH(Login!Q$15,Data!$D$4:$X$4,0),FALSE)),\"\")","v":""},{"$f":"IFERROR(IF(VLOOKUP(R$16&$M$11&$M31,Data!$D:$X,MATCH(Login!R$15,Data!$D$4:$X$4,0),FALSE)=0,\"\",VLOOKUP(R$16&$M$11&$M31,Data!$D:$X,MATCH(Login!R$15,Data!$D$4:$X$4,0),FALSE)),\"\")","v":""},{"$f":"IFERROR(IF(VLOOKUP(S$16&$M$11&$M31,Data!$D:$X,MATCH(Login!S$15,Data!$D$4:$X$4,0),FALSE)=0,\"\",VLOOKUP(S$16&$M$11&$M31,Data!$D:$X,MATCH(Login!S$15,Data!$D$4:$X$4,0),FALSE)),\"\")","v":""},{"$f":"IFERROR(IF(VLOOKUP(T$16&$M$11&$M31,Data!$D:$X,MATCH(Login!T$15,Data!$D$4:$X$4,0),FALSE)=0,\"\",VLOOKUP(T$16&$M$11&$M31,Data!$D:$X,MATCH(Login!T$15,Data!$D$4:$X$4,0),FALSE)),\"\")","v":""},{"$f":"IFERROR(IF(VLOOKUP(U$16&$M$11&$M31,Data!$D:$X,MATCH(Login!U$15,Data!$D$4:$X$4,0),FALSE)=0,\"\",VLOOKUP(U$16&$M$11&$M31,Data!$D:$X,MATCH(Login!U$15,Data!$D$4:$X$4,0),FALSE)),\"\")","v":""},null,"",null,0,null,0,null,0,null,0]
[null,0,null,0,null,0,null,0,"2017-10-13",13,null,null,"",{"$f":"IFERROR(IF(VLOOKUP(N$16&$M$11&$M32,Data!$D:$X,MATCH(Login!N$15,Data!$D$4:$X$4,0),FALSE)=0,\"\",VLOOKUP(N$16&$M$11&$M32,Data!$D:$X,MATCH(Login!N$15,Data!$D$4:$X$4,0),FALSE)),\"\")","v":""},{"$f":"IFERROR(IF(VLOOKUP(O$16&$M$11&$M32,Data!$D:$X,MATCH(Login!O$15,Data!$D$4:$X$4,0),FALSE)=0,\"\",VLOOKUP(O$16&$M$11&$M32,Data!$D:$X,MATCH(Login!O$15,Data!$D$4:$X$4,0),FALSE)),\"\")","v":""},{"$f":"IFERROR(IF(VLOOKUP(P$16&$M$11&$M32,Data!$D:$X,MATCH(Login!P$15,Data!$D$4:$X$4,0),FALSE)=0,\"\",VLOOKUP(P$16&$M$11&$M32,Data!$D:$X,MATCH(Login!P$15,Data!$D$4:$X$4,0),FALSE)),\"\")","v":""},{"$f":"IFERROR(IF(VLOOKUP(Q$16&$M$11&$M32,Data!$D:$X,MATCH(Login!Q$15,Data!$D$4:$X$4,0),FALSE)=0,\"\",VLOOKUP(Q$16&$M$11&$M32,Data!$D:$X,MATCH(Login!Q$15,Data!$D$4:$X$4,0),FALSE)),\"\")","v":""},{"$f":"IFERROR(IF(VLOOKUP(R$16&$M$11&$M32,Data!$D:$X,MATCH(Login!R$15,Data!$D$4:$X$4,0),FALSE)=0,\"\",VLOOKUP(R$16&$M$11&$M32,Data!$D:$X,MATCH(Login!R$15,Data!$D$4:$X$4,0),FALSE)),\"\")","v":""},{"$f":"IFERROR(IF(VLOOKUP(S$16&$M$11&$M32,Data!$D:$X,MATCH(Login!S$15,Data!$D$4:$X$4,0),FALSE)=0,\"\",VLOOKUP(S$16&$M$11&$M32,Data!$D:$X,MATCH(Login!S$15,Data!$D$4:$X$4,0),FALSE)),\"\")","v":""},{"$f":"IFERROR(IF(VLOOKUP(T$16&$M$11&$M32,Data!$D:$X,MATCH(Login!T$15,Data!$D$4:$X$4,0),FALSE)=0,\"\",VLOOKUP(T$16&$M$11&$M32,Data!$D:$X,MATCH(Login!T$15,Data!$D$4:$X$4,0),FALSE)),\"\")","v":""},{"$f":"IFERROR(IF(VLOOKUP(U$16&$M$11&$M32,Data!$D:$X,MATCH(Login!U$15,Data!$D$4:$X$4,0),FALSE)=0,\"\",VLOOKUP(U$16&$M$11&$M32,Data!$D:$X,MATCH(Login!U$15,Data!$D$4:$X$4,0),FALSE)),\"\")","v":""},null,"",null,{"$f":"(IFERROR(IF(B32=1,0,O32-N32),0)*86400/60/60)","v":0},null,{"$f":"(IFERROR(IF(D32=1,0,Q32-P32),0)*86400/60/60)","v":0},null,{"$f":"(IFERROR(IF(F32=1,0,S32-R32),0)*86400/60/60)","v":0},null,{"$f":"(IFERROR(IF(H32=1,0,U32-T32),0)*86400/60/60)","v":0}]
[null,0,null,0,null,0,null,0,"2017-10-14",14,null,null,"",{"$f":"IFERROR(IF(VLOOKUP(N$16&$M$11&$M33,Data!$D:$X,MATCH(Login!N$15,Data!$D$4:$X$4,0),FALSE)=0,\"\",VLOOKUP(N$16&$M$11&$M33,Data!$D:$X,MATCH(Login!N$15,Data!$D$4:$X$4,0),FALSE)),\"\")","v":""},{"$f":"IFERROR(IF(VLOOKUP(O$16&$M$11&$M33,Data!$D:$X,MATCH(Login!O$15,Data!$D$4:$X$4,0),FALSE)=0,\"\",VLOOKUP(O$16&$M$11&$M33,Data!$D:$X,MATCH(Login!O$15,Data!$D$4:$X$4,0),FALSE)),\"\")","v":""},{"$f":"IFERROR(IF(VLOOKUP(P$16&$M$11&$M33,Data!$D:$X,MATCH(Login!P$15,Data!$D$4:$X$4,0),FALSE)=0,\"\",VLOOKUP(P$16&$M$11&$M33,Data!$D:$X,MATCH(Login!P$15,Data!$D$4:$X$4,0),FALSE)),\"\")","v":""},{"$f":"IFERROR(IF(VLOOKUP(Q$16&$M$11&$M33,Data!$D:$X,MATCH(Login!Q$15,Data!$D$4:$X$4,0),FALSE)=0,\"\",VLOOKUP(Q$16&$M$11&$M33,Data!$D:$X,MATCH(Login!Q$15,Data!$D$4:$X$4,0),FALSE)),\"\")","v":""},{"$f":"IFERROR(IF(VLOOKUP(R$16&$M$11&$M33,Data!$D:$X,MATCH(Login!R$15,Data!$D$4:$X$4,0),FALSE)=0,\"\",VLOOKUP(R$16&$M$11&$M33,Data!$D:$X,MATCH(Login!R$15,Data!$D$4:$X$4,0),FALSE)),\"\")","v":""},{"$f":"IFERROR(IF(VLOOKUP(S$16&$M$11&$M33,Data!$D:$X,MATCH(Login!S$15,Data!$D$4:$X$4,0),FALSE)=0,\"\",VLOOKUP(S$16&$M$11&$M33,Data!$D:$X,MATCH(Login!S$15,Data!$D$4:$X$4,0),FALSE)),\"\")","v":""},{"$f":"IFERROR(IF(VLOOKUP(T$16&$M$11&$M33,Data!$D:$X,MATCH(Login!T$15,Data!$D$4:$X$4,0),FALSE)=0,\"\",VLOOKUP(T$16&$M$11&$M33,Data!$D:$X,MATCH(Login!T$15,Data!$D$4:$X$4,0),FALSE)),\"\")","v":""},{"$f":"IFERROR(IF(VLOOKUP(U$16&$M$11&$M33,Data!$D:$X,MATCH(Login!U$15,Data!$D$4:$X$4,0),FALSE)=0,\"\",VLOOKUP(U$16&$M$11&$M33,Data!$D:$X,MATCH(Login!U$15,Data!$D$4:$X$4,0),FALSE)),\"\")","v":""},null,"",null,{"$f":"(IFERROR(IF(B33=1,0,O33-N33),0)*86400/60/60)","v":0},null,0,null,0,null,0]
[null,0,null,0,null,0,null,0,"2017-10-15",15,null,null,"",{"$f":"IFERROR(IF(VLOOKUP(N$16&$M$11&$M34,Data!$D:$X,MATCH(Login!N$15,Data!$D$4:$X$4,0),FALSE)=0,\"\",VLOOKUP(N$16&$M$11&$M34,Data!$D:$X,MATCH(Login!N$15,Data!$D$4:$X$4,0),FALSE)),\"\")","v":""},{"$f":"IFERROR(IF(VLOOKUP(O$16&$M$11&$M34,Data!$D:$X,MATCH(Login!O$15,Data!$D$4:$X$4,0),FALSE)=0,\"\",VLOOKUP(O$16&$M$11&$M34,Data!$D:$X,MATCH(Login!O$15,Data!$D$4:$X$4,0),FALSE)),\"\")","v":""},{"$f":"IFERROR(IF(VLOOKUP(P$16&$M$11&$M34,Data!$D:$X,MATCH(Login!P$15,Data!$D$4:$X$4,0),FALSE)=0,\"\",VLOOKUP(P$16&$M$11&$M34,Data!$D:$X,MATCH(Login!P$15,Data!$D$4:$X$4,0),FALSE)),\"\")","v":""},{"$f":"IFERROR(IF(VLOOKUP(Q$16&$M$11&$M34,Data!$D:$X,MATCH(Login!Q$15,Data!$D$4:$X$4,0),FALSE)=0,\"\",VLOOKUP(Q$16&$M$11&$M34,Data!$D:$X,MATCH(Login!Q$15,Data!$D$4:$X$4,0),FALSE)),\"\")","v":""},{"$f":"IFERROR(IF(VLOOKUP(R$16&$M$11&$M34,Data!$D:$X,MATCH(Login!R$15,Data!$D$4:$X$4,0),FALSE)=0,\"\",VLOOKUP(R$16&$M$11&$M34,Data!$D:$X,MATCH(Login!R$15,Data!$D$4:$X$4,0),FALSE)),\"\")","v":""},{"$f":"IFERROR(IF(VLOOKUP(S$16&$M$11&$M34,Data!$D:$X,MATCH(Login!S$15,Data!$D$4:$X$4,0),FALSE)=0,\"\",VLOOKUP(S$16&$M$11&$M34,Data!$D:$X,MATCH(Login!S$15,Data!$D$4:$X$4,0),FALSE)),\"\")","v":""},{"$f":"IFERROR(IF(VLOOKUP(T$16&$M$11&$M34,Data!$D:$X,MATCH(Login!T$15,Data!$D$4:$X$4,0),FALSE)=0,\"\",VLOOKUP(T$16&$M$11&$M34,Data!$D:$X,MATCH(Login!T$15,Data!$D$4:$X$4,0),FALSE)),\"\")","v":""},{"$f":"IFERROR(IF(VLOOKUP(U$16&$M$11&$M34,Data!$D:$X,MATCH(Login!U$15,Data!$D$4:$X$4,0),FALSE)=0,\"\",VLOOKUP(U$16&$M$11&$M34,Data!$D:$X,MATCH(Login!U$15,Data!$D$4:$X$4,0),FALSE)),\"\")","v":""},null,"",null,0,null,0,null,0,null,0]
[null,0,null,0,null,0,null,0,"",16,null,null,"",{"$f":"IFERROR(IF(VLOOKUP(N$16&$M$11&$M35,Data!$D:$X,MATCH(Login!N$15,Data!$D$4:$X$4,0),FALSE)=0,\"\",VLOOKUP(N$16&$M$11&$M35,Data!$D:$X,MATCH(Login!N$15,Data!$D$4:$X$4,0),FALSE)),\"\")","v":""},{"$f":"IFERROR(IF(VLOOKUP(O$16&$M$11&$M35,Data!$D:$X,MATCH(Login!O$15,Data!$D$4:$X$4,0),FALSE)=0,\"\",VLOOKUP(O$16&$M$11&$M35,Data!$D:$X,MATCH(Login!O$15,Data!$D$4:$X$4,0),FALSE)),\"\")","v":""},{"$f":"IFERROR(IF(VLOOKUP(P$16&$M$11&$M35,Data!$D:$X,MATCH(Login!P$15,Data!$D$4:$X$4,0),FALSE)=0,\"\",VLOOKUP(P$16&$M$11&$M35,Data!$D:$X,MATCH(Login!P$15,Data!$D$4:$X$4,0),FALSE)),\"\")","v":""},{"$f":"IFERROR(IF(VLOOKUP(Q$16&$M$11&$M35,Data!$D:$X,MATCH(Login!Q$15,Data!$D$4:$X$4,0),FALSE)=0,\"\",VLOOKUP(Q$16&$M$11&$M35,Data!$D:$X,MATCH(Login!Q$15,Data!$D$4:$X$4,0),FALSE)),\"\")","v":""},{"$f":"IFERROR(IF(VLOOKUP(R$16&$M$11&$M35,Data!$D:$X,MATCH(Login!R$15,Data!$D$4:$X$4,0),FALSE)=0,\"\",VLOOKUP(R$16&$M$11&$M35,Data!$D:$X,MATCH(Login!R$15,Data!$D$4:$X$4,0),FALSE)),\"\")","v":""},{"$f":"IFERROR(IF(VLOOKUP(S$16&$M$11&$M35,Data!$D:$X,MATCH(Login!S$15,Data!$D$4:$X$4,0),FALSE)=0,\"\",VLOOKUP(S$16&$M$11&$M35,Data!$D:$X,MATCH(Login!S$15,Data!$D$4:$X$4,0),FALSE)),\"\")","v":""},{"$f":"IFERROR(IF(VLOOKUP(T$16&$M$11&$M35,Data!$D:$X,MATCH(Login!T$15,Data!$D$4:$X$4,0),FALSE)=0,\"\",VLOOKUP(T$16&$M$11&$M35,Data!$D:$X,MATCH(Login!T$15,Data!$D$4:$X$4,0),FALSE)),\"\")","v":""},{"$f":"IFERROR(IF(VLOOKUP(U$16&$M$11&$M35,Data!$D:$X,MATCH(Login!U$15,Data!$D$4:$X$4,0),FALSE)=0,\"\",VLOOKUP(U$16&$M$11&$M35,Data!$D:$X,MATCH(Login!U$15,Data!$D$4:$X$4,0),FALSE)),\"\")","v":""},null,"",null,0,null,0,null,0,null,0]
[null,0,null,0,null,0,null,0,"",17,null,null,"",{"$f":"IFERROR(IF(VLOOKUP(N$16&$M$11&$M36,Data!$D:$X,MATCH(Login!N$15,Data!$D$4:$X$4,0),FALSE)=0,\"\",VLOOKUP(N$16&$M$11&$M36,Data!$D:$X,MATCH(Login!N$15,Data!$D$4:$X$4,0),FALSE)),\"\")","v":""},{"$f":"IFERROR(IF(VLOOKUP(O$16&$M$11&$M36,Data!$D:$X,MATCH(Login!O$15,Data!$D$4:$X$4,0),FALSE)=0,\"\",VLOOKUP(O$16&$M$11&$M36,Data!$D:$X,MATCH(Login!O$15,Data!$D$4:$X$4,0),FALSE)),\"\")","v":""},{"$f":"IFERROR(IF(VLOOKUP(P$16&$M$11&$M36,Data!$D:$X,MATCH(Login!P$15,Data!$D$4:$X$4,0),FALSE)=0,\"\",VLOOKUP(P$16&$M$11&$M36,Data!$D:$X,MATCH(Login!P$15,Data!$D$4:$X$4,0),FALSE)),\"\")","v":""},{"$f":"IFERROR(IF(VLOOKUP(Q$16&$M$11&$M36,Data!$D:$X,MATCH(Login!Q$15,Data!$D$4:$X$4,0),FALSE)=0,\"\",VLOOKUP(Q$16&$M$11&$M36,Data!$D:$X,MATCH(Login!Q$15,Data!$D$4:$X$4,0),FALSE)),\"\")","v":""},{"$f":"IFERROR(IF(VLOOKUP(R$16&$M$11&$M36,Data!$D:$X,MATCH(Login!R$15,Data!$D$4:$X$4,0),FALSE)=0,\"\",VLOOKUP(R$16&$M$11&$M36,Data!$D:$X,MATCH(Login!R$15,Data!$D$4:$X$4,0),FALSE)),\"\")","v":""},{"$f":"IFERROR(IF(VLOOKUP(S$16&$M$11&$M36,Data!$D:$X,MATCH(Login!S$15,Data!$D$4:$X$4,0),FALSE)=0,\"\",VLOOKUP(S$16&$M$11&$M36,Data!$D:$X,MATCH(Login!S$15,Data!$D$4:$X$4,0),FALSE)),\"\")","v":""},{"$f":"IFERROR(IF(VLOOKUP(T$16&$M$11&$M36,Data!$D:$X,MATCH(Login!T$15,Data!$D$4:$X$4,0),FALSE)=0,\"\",VLOOKUP(T$16&$M$11&$M36,Data!$D:$X,MATCH(Login!T$15,Data!$D$4:$X$4,0),FALSE)),\"\")","v":""},{"$f":"IFERROR(IF(VLOOKUP(U$16&$M$11&$M36,Data!$D:$X,MATCH(Login!U$15,Data!$D$4:$X$4,0),FALSE)=0,\"\",VLOOKUP(U$16&$M$11&$M36,Data!$D:$X,MATCH(Login!U$15,Data!$D$4:$X$4,0),FALSE)),\"\")","v":""},null,"",null,0,null,0,null,0,null,0]
[null,0,null,0,null,0,null,0,"",18,null,null,"",{"$f":"IFERROR(IF(VLOOKUP(N$16&$M$11&$M37,Data!$D:$X,MATCH(Login!N$15,Data!$D$4:$X$4,0),FALSE)=0,\"\",VLOOKUP(N$16&$M$11&$M37,Data!$D:$X,MATCH(Login!N$15,Data!$D$4:$X$4,0),FALSE)),\"\")","v":""},{"$f":"IFERROR(IF(VLOOKUP(O$16&$M$11&$M37,Data!$D:$X,MATCH(Login!O$15,Data!$D$4:$X$4,0),FALSE)=0,\"\",VLOOKUP(O$16&$M$11&$M37,Data!$D:$X,MATCH(Login!O$15,Data!$D$4:$X$4,0),FALSE)),\"\")","v":""},{"$f":"IFERROR(IF(VLOOKUP(P$16&$M$11&$M37,Data!$D:$X,MATCH(Login!P$15,Data!$D$4:$X$4,0),FALSE)=0,\"\",VLOOKUP(P$16&$M$11&$M37,Data!$D:$X,MATCH(Login!P$15,Data!$D$4:$X$4,0),FALSE)),\"\")","v":""},{"$f":"IFERROR(IF(VLOOKUP(Q$16&$M$11&$M37,Data!$D:$X,MATCH(Login!Q$15,Data!$D$4:$X$4,0),FALSE)=0,\"\",VLOOKUP(Q$16&$M$11&$M37,Data!$D:$X,MATCH(Login!Q$15,Data!$D$4:$X$4,0),FALSE)),\"\")","v":""},{"$f":"IFERROR(IF(VLOOKUP(R$16&$M$11&$M37,Data!$D:$X,MATCH(Login!R$15,Data!$D$4:$X$4,0),FALSE)=0,\"\",VLOOKUP(R$16&$M$11&$M37,Data!$D:$X,MATCH(Login!R$15,Data!$D$4:$X$4,0),FALSE)),\"\")","v":""},{"$f":"IFERROR(IF(VLOOKUP(S$16&$M$11&$M37,Data!$D:$X,MATCH(Login!S$15,Data!$D$4:$X$4,0),FALSE)=0,\"\",VLOOKUP(S$16&$M$11&$M37,Data!$D:$X,MATCH(Login!S$15,Data!$D$4:$X$4,0),FALSE)),\"\")","v":""},{"$f":"IFERROR(IF(VLOOKUP(T$16&$M$11&$M37,Data!$D:$X,MATCH(Login!T$15,Data!$D$4:$X$4,0),FALSE)=0,\"\",VLOOKUP(T$16&$M$11&$M37,Data!$D:$X,MATCH(Login!T$15,Data!$D$4:$X$4,0),FALSE)),\"\")","v":""},{"$f":"IFERROR(IF(VLOOKUP(U$16&$M$11&$M37,Data!$D:$X,MATCH(Login!U$15,Data!$D$4:$X$4,0),FALSE)=0,\"\",VLOOKUP(U$16&$M$11&$M37,Data!$D:$X,MATCH(Login!U$15,Data!$D$4:$X$4,0),FALSE)),\"\")","v":""},null,"",null,0,null,0,null,0,null,0]
[null,0,null,0,null,0,null,0,"",19,null,null,"",{"$f":"IFERROR(IF(VLOOKUP(N$16&$M$11&$M38,Data!$D:$X,MATCH(Login!N$15,Data!$D$4:$X$4,0),FALSE)=0,\"\",VLOOKUP(N$16&$M$11&$M38,Data!$D:$X,MATCH(Login!N$15,Data!$D$4:$X$4,0),FALSE)),\"\")","v":""},{"$f":"IFERROR(IF(VLOOKUP(O$16&$M$11&$M38,Data!$D:$X,MATCH(Login!O$15,Data!$D$4:$X$4,0),FALSE)=0,\"\",VLOOKUP(O$16&$M$11&$M38,Data!$D:$X,MATCH(Login!O$15,Data!$D$4:$X$4,0),FALSE)),\"\")","v":""},{"$f":"IFERROR(IF(VLOOKUP(P$16&$M$11&$M38,Data!$D:$X,MATCH(Login!P$15,Data!$D$4:$X$4,0),FALSE)=0,\"\",VLOOKUP(P$16&$M$11&$M38,Data!$D:$X,MATCH(Login!P$15,Data!$D$4:$X$4,0),FALSE)),\"\")","v":""},{"$f":"IFERROR(IF(VLOOKUP(Q$16&$M$11&$M38,Data!$D:$X,MATCH(Login!Q$15,Data!$D$4:$X$4,0),FALSE)=0,\"\",VLOOKUP(Q$16&$M$11&$M38,Data!$D:$X,MATCH(Login!Q$15,Data!$D$4:$X$4,0),FALSE)),\"\")","v":""},{"$f":"IFERROR(IF(VLOOKUP(R$16&$M$11&$M38,Data!$D:$X,MATCH(Login!R$15,Data!$D$4:$X$4,0),FALSE)=0,\"\",VLOOKUP(R$16&$M$11&$M38,Data!$D:$X,MATCH(Login!R$15,Data!$D$4:$X$4,0),FALSE)),\"\")","v":""},{"$f":"IFERROR(IF(VLOOKUP(S$16&$M$11&$M38,Data!$D:$X,MATCH(Login!S$15,Data!$D$4:$X$4,0),FALSE)=0,\"\",VLOOKUP(S$16&$M$11&$M38,Data!$D:$X,MATCH(Login!S$15,Data!$D$4:$X$4,0),FALSE)),\"\")","v":""},{"$f":"IFERROR(IF(VLOOKUP(T$16&$M$11&$M38,Data!$D:$X,MATCH(Login!T$15,Data!$D$4:$X$4,0),FALSE)=0,\"\",VLOOKUP(T$16&$M$11&$M38,Data!$D:$X,MATCH(Login!T$15,Data!$D$4:$X$4,0),FALSE)),\"\")","v":""},{"$f":"IFERROR(IF(VLOOKUP(U$16&$M$11&$M38,Data!$D:$X,MATCH(Login!U$15,Data!$D$4:$X$4,0),FALSE)=0,\"\",VLOOKUP(U$16&$M$11&$M38,Data!$D:$X,MATCH(Login!U$15,Data!$D$4:$X$4,0),FALSE)),\"\")","v":""},null,"",null,0,null,0,null,0,null,0]
[null,0,null,0,null,0,null,0,"",20,null,null,"",{"$f":"IFERROR(IF(VLOOKUP(N$16&$M$11&$M39,Data!$D:$X,MATCH(Login!N$15,Data!$D$4:$X$4,0),FALSE)=0,\"\",VLOOKUP(N$16&$M$11&$M39,Data!$D:$X,MATCH(Login!N$15,Data!$D$4:$X$4,0),FALSE)),\"\")","v":""},{"$f":"IFERROR(IF(VLOOKUP(O$16&$M$11&$M39,Data!$D:$X,MATCH(Login!O$15,Data!$D$4:$X$4,0),FALSE)=0,\"\",VLOOKUP(O$16&$M$11&$M39,Data!$D:$X,MATCH(Login!O$15,Data!$D$4:$X$4,0),FALSE)),\"\")","v":""},{"$f":"IFERROR(IF(VLOOKUP(P$16&$M$11&$M39,Data!$D:$X,MATCH(Login!P$15,Data!$D$4:$X$4,0),FALSE)=0,\"\",VLOOKUP(P$16&$M$11&$M39,Data!$D:$X,MATCH(Login!P$15,Data!$D$4:$X$4,0),FALSE)),\"\")","v":""},{"$f":"IFERROR(IF(VLOOKUP(Q$16&$M$11&$M39,Data!$D:$X,MATCH(Login!Q$15,Data!$D$4:$X$4,0),FALSE)=0,\"\",VLOOKUP(Q$16&$M$11&$M39,Data!$D:$X,MATCH(Login!Q$15,Data!$D$4:$X$4,0),FALSE)),\"\")","v":""},{"$f":"IFERROR(IF(VLOOKUP(R$16&$M$11&$M39,Data!$D:$X,MATCH(Login!R$15,Data!$D$4:$X$4,0),FALSE)=0,\"\",VLOOKUP(R$16&$M$11&$M39,Data!$D:$X,MATCH(Login!R$15,Data!$D$4:$X$4,0),FALSE)),\"\")","v":""},{"$f":"IFERROR(IF(VLOOKUP(S$16&$M$11&$M39,Data!$D:$X,MATCH(Login!S$15,Data!$D$4:$X$4,0),FALSE)=0,\"\",VLOOKUP(S$16&$M$11&$M39,Data!$D:$X,MATCH(Login!S$15,Data!$D$4:$X$4,0),FALSE)),\"\")","v":""},{"$f":"IFERROR(IF(VLOOKUP(T$16&$M$11&$M39,Data!$D:$X,MATCH(Login!T$15,Data!$D$4:$X$4,0),FALSE)=0,\"\",VLOOKUP(T$16&$M$11&$M39,Data!$D:$X,MATCH(Login!T$15,Data!$D$4:$X$4,0),FALSE)),\"\")","v":""},{"$f":"IFERROR(IF(VLOOKUP(U$16&$M$11&$M39,Data!$D:$X,MATCH(Login!U$15,Data!$D$4:$X$4,0),FALSE)=0,\"\",VLOOKUP(U$16&$M$11&$M39,Data!$D:$X,MATCH(Login!U$15,Data!$D$4:$X$4,0),FALSE)),\"\")","v":""},null,"",null,0,null,0,null,0,null,0]

{"sheet":"Staff","index":5,"n_rows":61,"n_cols":12,"rows_kept":61,"cut":false,"hidden":true,"merged":[]}
[null,null,null,{"$f":"COUNTIF(A11:A100,\"OK\")+10","v":12}]
[]
[]
[]
[]
[]
[]
[]
[{"$f":"IF(Admin_License!AI2=\"\",10,Admin_License!AI2)+1","v":11}]
[null,null,"ID #","Full Name","Staff Type","Full/Part Time","Hourly Rate","Stat. Holiday\n (# of Hours)","Password","Start Date","End Date","Time in Practice (years)"]
["OK",null,0,"(Select One)",null,null,null,null,null,null,null,{"$f":"IF(D11=\"\",\"\",IF(K11=\"\",TODAY()-J11,K11-J11))/365","v":117.98630136986301}]
["OK",null,1,"Manager","Manager",null,null,null,"password"]
[{"$f":"IF(C13>$A$9,\"NO\",IF(D13=\"\",\"\",\"OK\"))","v":""},null,2,null,null,null,null,null,null,null,null,{"$f":"IF(D13=\"\",\"\",(IF(K13=\"\",TODAY()-J13,K13-J13)/365))","v":""}]
[{"$f":"IF(C14>$A$9,\"NO\",IF(D14=\"\",\"\",\"OK\"))","v":""},null,3,null,null,null,null,null,null,null,null,""]
["",null,4,null,null,null,null,null,null,null,null,""]
["",null,5,null,null,null,null,null,null,null,null,""]
["",null,6,null,null,null,null,null,null,null,null,""]
["",null,7,null,null,null,null,null,null,null,null,""]
["",null,8,null,null,null,null,null,null,null,null,""]
["",null,9,null,null,null,null,null,null,null,null,""]
["",null,10,null,null,null,null,null,null,null,null,""]
["",null,11,null,null,null,null,null,null,null,null,""]
["NO",null,12,null,null,null,null,null,null,null,null,""]
["NO",null,13,null,null,null,null,null,null,null,null,""]
["NO",null,14,null,null,null,null,null,null,null,null,""]
["NO",null,15,null,null,null,null,null,null,null,null,""]
["NO",null,16,null,null,null,null,null,null,null,null,""]
["NO",null,17,null,null,null,null,null,null,null,null,""]
["NO",null,18,null,null,null,null,null,null,null,null,""]
["NO",null,19,null,null,null,null,null,null,null,null,""]
["NO",null,20,null,null,null,null,null,null,null,null,""]
["NO",null,21,null,null,null,null,null,null,null,null,{"$f":"IF(D32=\"\",\"\",(IF(K32=\"\",TODAY()-J32,K32-J32)/365))","v":""}]
["NO",null,22,null,null,null,null,null,null,null,null,""]
["NO",null,23,null,null,null,null,null,null,null,null,""]
["NO",null,24,null,null,null,null,null,null,null,null,""]
["NO",null,25,null,null,null,null,null,null,null,null,""]
["NO",null,26,null,null,null,null,null,null,null,null,""]
["NO",null,27,null,null,null,null,null,null,null,null,""]
["NO",null,28,null,null,null,null,null,null,null,null,""]
["NO",null,29,null,null,null,null,null,null,null,null,""]
["NO",null,30,null,null,null,null,null,null,null,null,""]
["NO",null,31,null,null,null,null,null,null,null,null,""]
["NO",null,32,null,null,null,null,null,null,null,null,""]
["NO",null,33,null,null,null,null,null,null,null,null,""]
["NO",null,34,null,null,null,null,null,null,null,null,""]
["NO",null,35,null,null,null,null,null,null,null,null,""]
["NO",null,36,null,null,null,null,null,null,null,null,""]
["NO",null,37,null,null,null,null,null,null,null,null,""]
["NO",null,38,null,null,null,null,null,null,null,null,""]
["NO",null,39,null,null,null,null,null,null,null,null,""]
["NO",null,40,null,null,null,null,null,null,null,null,""]
["NO",null,41,null,null,null,null,null,null,null,null,""]
["NO",null,42,null,null,null,null,null,null,null,null,""]
["NO",null,43,null,null,null,null,null,null,null,null,""]
["NO",null,44,null,null,null,null,null,null,null,null,""]
["NO",null,45,null,null,null,null,null,null,null,null,""]
["NO",null,46,null,null,null,null,null,null,null,null,""]
["NO",null,47,null,null,null,null,null,null,null,null,""]
["NO",null,48,null,null,null,null,null,null,null,null,""]
["NO",null,49,null,null,null,null,null,null,null,null,""]
["NO",null,50,null,null,null,null,null,null,null,null,{"$f":"IF(D61=\"\",\"\",(IF(K61=\"\",TODAY()-J61,K61-J61)/365))","v":""}]

{"sheet":"Admin","index":6,"n_rows":47,"n_cols":14,"rows_kept":47,"cut":false,"hidden":true,"merged":[]}
[]
[]
[]
[]
[]
[null,null,"ADMIN"]
[null,null,"Pay Period Start","Pay Period End","Pay Period Number","# of Holidays","Period",null,"Days",null,null,"Staff Type",null,"Full/Part Time"]
[null,null,"2017-09-01",{"$f":"C8+14","v":"2017-09-15"},1,null,{"$f":"TEXT(C8,\"d-mmm\")&\"/\" &TEXT(D8,\"d-mmm\")","v":"1-Sep/15-Sep"},{"$f":"C8","v":"2017-09-01"},{"$f":"H9-H8","v":15},null,null,".",null,"Full Time"]
[null,null,{"$f":"D8+1","v":"2017-09-16"},{"$f":"EOMONTH(C9,0)","v":"2017-09-30"},{"$f":"E8+1","v":2},null,{"$f":"TEXT(C9,\"d-mmm\")&\"/\" &TEXT(D9,\"d-mmm\")","v":"16-Sep/30-Sep"},{"$f":"C9","v":"2017-09-16"},{"$f":"H10-H9","v":15},null,null,".",null,"Part Time"]
[null,null,{"$f":"D9+1","v":"2017-10-01"},{"$f":"C10+14","v":"2017-10-15"},{"$f":"E9+1","v":3},null,"1-Oct/15-Oct","2017-10-01",15,null,null,".",null,"Contract"]
[null,null,{"$f":"D10+1","v":"2017-10-16"},{"$f":"EOMONTH(C11,0)","v":"2017-10-31"},4,null,"16-Oct/31-Oct","2017-10-16",16,null,null,".",null,"."]
[null,null,{"$f":"D11+1","v":"2017-11-01"},{"$f":"C12+14","v":"2017-11-15"},5,null,"1-Nov/15-Nov","2017-11-01",15,null,null,".",null,"."]
[null,null,{"$f":"D12+1","v":"2017-11-16"},{"$f":"EOMONTH(C13,0)","v":"2017-11-30"},6,null,"16-Nov/30-Nov","2017-11-16",15,null,null,".",null,"."]
[null,null,"2017-12-01",{"$f":"C14+14","v":"2017-12-15"},7,null,"1-Dec/15-Dec","2017-12-01",15,null,null,".",null,"."]
[null,null,"2017-12-16",{"$f":"EOMONTH(C15,0)","v":"2017-12-31"},8,null,"16-Dec/31-Dec","2017-12-16",16,null,null,".",null,"."]
[null,null,"2018-01-01",{"$f":"C16+14","v":"2018-01-15"},9,null,"1-Jan/15-Jan","2018-01-01",15,null,null,".",null,"."]
[null,null,"2018-01-16",{"$f":"EOMONTH(C17,0)","v":"2018-01-31"},10,null,"16-Jan/31-Jan","2018-01-16",16,null,null,".",null,"."]
[null,null,"2018-02-01",{"$f":"C18+14","v":"2018-02-15"},11,null,"1-Feb/15-Feb","2018-02-01",15]
[null,null,"2018-02-16",{"$f":"EOMONTH(C19,0)","v":"2018-02-28"},12,null,"16-Feb/28-Feb","2018-02-16",13]
[null,null,"2018-03-01",{"$f":"C20+14","v":"2018-03-15"},13,null,"1-Mar/15-Mar","2018-03-01",15]
[null,null,"2018-03-16",{"$f":"EOMONTH(C21,0)","v":"2018-03-31"},14,null,"16-Mar/31-Mar","2018-03-16",16]
[null,null,"2018-04-01",{"$f":"C22+14","v":"2018-04-15"},15,null,"1-Apr/15-Apr","2018-04-01",15]
[null,null,"2018-04-16",{"$f":"EOMONTH(C23,0)","v":"2018-04-30"},16,null,"16-Apr/30-Apr","2018-04-16",15]
[null,null,"2018-05-01",{"$f":"C24+14","v":"2018-05-15"},17,null,"1-May/15-May","2018-05-01",15]
[null,null,"2018-05-16",{"$f":"EOMONTH(C25,0)","v":"2018-05-31"},18,null,"16-May/31-May","2018-05-16",16]
[null,null,"2018-06-01",{"$f":"C26+14","v":"2018-06-15"},19,null,"1-Jun/15-Jun","2018-06-01",15]
[null,null,"2018-06-16",{"$f":"EOMONTH(C27,0)","v":"2018-06-30"},20,null,"16-Jun/30-Jun","2018-06-16",15]
[null,null,"2018-07-01",{"$f":"C28+14","v":"2018-07-15"},21,null,"1-Jul/15-Jul","2018-07-01",15]
[null,null,"2018-07-16",{"$f":"EOMONTH(C29,0)","v":"2018-07-31"},22,null,"16-Jul/31-Jul","2018-07-16",16]
[null,null,"2018-08-01",{"$f":"C30+14","v":"2018-08-15"},23,null,"1-Aug/15-Aug","2018-08-01",15]
[null,null,"2018-08-16",{"$f":"EOMONTH(C31,0)","v":"2018-08-31"},24,null,"16-Aug/31-Aug","2018-08-16",16]
[null,null,"2018-09-01",{"$f":"C32+14","v":"2018-09-15"},25,null,"1-Sep/15-Sep","2018-09-01",15]
[null,null,"2018-09-16",{"$f":"EOMONTH(C33,0)","v":"2018-09-30"},26,null,"16-Sep/30-Sep","2018-09-16",15]
[null,null,"2018-10-01",{"$f":"C34+14","v":"2018-10-15"},27,null,"1-Oct/15-Oct","2018-10-01",15]
[null,null,"2018-10-16",{"$f":"EOMONTH(C35,0)","v":"2018-10-31"},28,null,"16-Oct/31-Oct","2018-10-16",16]
[null,null,"2018-11-01",{"$f":"C36+14","v":"2018-11-15"},29,null,"1-Nov/15-Nov","2018-11-01",15]
[null,null,"2018-11-16",{"$f":"EOMONTH(C37,0)","v":"2018-11-30"},30,null,"16-Nov/30-Nov","2018-11-16",15]
[null,null,"2018-12-01",{"$f":"C38+14","v":"2018-12-15"},31,null,"1-Dec/15-Dec","2018-12-01",15]
[null,null,"2018-12-16",{"$f":"EOMONTH(C39,0)","v":"2018-12-31"},32,null,"16-Dec/31-Dec","2018-12-16",16]
[null,null,"2019-01-01",{"$f":"C40+14","v":"2019-01-15"},33,null,"1-Jan/15-Jan","2019-01-01",15]
[null,null,"2019-01-16",{"$f":"EOMONTH(C41,0)","v":"2019-01-31"},34,null,"16-Jan/31-Jan","2019-01-16",16]
[null,null,"2019-02-01",{"$f":"C42+14","v":"2019-02-15"},35,null,"1-Feb/15-Feb","2019-02-01",15]
[null,null,"2019-02-16",{"$f":"EOMONTH(C43,0)","v":"2019-02-28"},36,null,"16-Feb/28-Feb","2019-02-16",13]
[null,null,"2019-03-01",{"$f":"C44+14","v":"2019-03-15"},37,null,"1-Mar/15-Mar","2019-03-01",15]
[null,null,"2019-03-16",{"$f":"EOMONTH(C45,0)","v":"2019-03-31"},38,null,"16-Mar/31-Mar","2019-03-16",16]
[null,null,"2019-04-01",{"$f":"C46+14","v":"2019-04-15"},39,null,"1-Apr/15-Apr","2019-04-01",15]
[null,null,"2019-04-16",{"$f":"EOMONTH(C47,0)","v":"2019-04-30"},40,null,"16-Apr/30-Apr","2019-04-16",-43571]

{"sheet":"Login_Report","index":7,"n_rows":39,"n_cols":62,"rows_kept":39,"cut":false,"hidden":true,"merged":[[16,15,16,16]]}
[null,null,null,null,null,null,null,null,null,null,null,null,{"$f":"\"Staff!D11:D\"&Staff!D1","v":"Staff!D11:D12"}]
[]
[]
[]
[]
[]
[]
[]
[]
[null,{"$f":"TODAY()","v":"2017-11-26"},null,null,null,null,null,null,null,null,null,null,"MANAGER's LOGIN REPORT"]
[]
[]
[]
[]
["Pass",{"$f":"IFERROR(VLOOKUP(A14,Staff!D:L,6,FALSE),\"\")","v":""},null,"OK",null,null,null,null,null,null,null,null,null,"Time IN","Time OUT","Time IN","Time OUT","Time IN","Time OUT","Time IN","Time OUT",null,null,null,null,null,null,null,null,null,null,null,null,null,"OK",null,null,null,null,null,null,null,null,null,"Time IN","Time OUT","Time IN","Time OUT","Time IN","Time OUT","Time IN","Time OUT"]
[null,null,null,null,null,null,null,null,null,null,null,{"$f":"VLOOKUP($P$17,Admin!$G:$I,3,FALSE)","v":15},{"$f":"VLOOKUP($P$17,Admin!$G:$I,2,FALSE)","v":"2017-09-16"},1,1,2,2,3,3,4,4,null,null,null,null,null,null,null,null,null,null,null,null,null,null,null,null,null,null,null,null,null,null,{"$f":"TODAY()-VLOOKUP(AR17,RCUBE!X2:Y13,2,FALSE)","v":{"$error":"#N/A"}},1,1,2,2,3,3,4,4]
[null,null,null,null,null,null,null,null,null,null,null,"Select Staff:","Manager",null,"Select Pay Period:","16-Sep/30-Sep",null,null,null,null,null,null,null,null,null,null,null,null,null,null,null,null,null,null,null,null,null,null,null,null,null,null,"Select Day:","2017-09-17"]
[null,null,null,null,null,null,null,null,null,null,null,null,null,null,null,null,null,null,null,null,null,"Total",{"$f":"SUM(W20:W39)","v":0},null,null,null,null,null,null,null,null,null,null,null,null,null,null,null,null,null,null,null,null,null,null,null,null,null,null,null,null,null,"Total",{"$f":"SUM(BB20:BB39)","v":0}]
["IN","OUT","IN","OUT","IN","OUT","IN","OUT","Day","count",null,null,"Date","IN","OUT","IN","OUT","IN","OUT","IN","OUT",null,"Hours Worked",null,"Shift 1",null,"Shift 1",null,"Shift 1",null,"Shift 1","IN","OUT","IN","OUT","IN","OUT","IN","OUT",null,null,null,null,"Staff Name","IN","OUT","IN","OUT","IN","OUT","IN","OUT",null,"Hours Worked",null,"Shift 1",null,"Shift 1",null,"Shift 1",null,"Shift 1"]
[null,{"$f":"IF(AND(N20<>\"\",O20=\"\"),1,0)","v":0},null,{"$f":"IF(AND(P20<>\"\",Q20=\"\"),1,0)","v":0},null,{"$f":"IF(AND(R20<>\"\",S20=\"\"),1,0)","v":0},null,{"$f":"IF(AND(T20<>\"\",U20=\"\"),1,0)","v":0},{"$f":"M16","v":"2017-09-16"},1,null,null,{"$f":"IF($D$15=\"OK\",I20,\"\")","v":"2017-09-16"},{"$f":"IFERROR(IF(VLOOKUP(N$16&$M$17&$M20,Data!$D:$X,MATCH(Login_Report!N$15,Data!$D$4:$X$4,0),FALSE)=0,\"\",VLOOKUP(N$16&$M$17&$M20,Data!$D:$X,MATCH(Login_Report!N$15,Data!$D$4:$X$4,0),FALSE)),\"\")","v":""},{"$f":"IFERROR(IF(VLOOKUP(O$16&$M$17&$M20,Data!$D:$X,MATCH(Login_Report!O$15,Data!$D$4:$X$4,0),FALSE)=0,\"\",VLOOKUP(O$16&$M$17&$M20,Data!$D:$X,MATCH(Login_Report!O$15,Data!$D$4:$X$4,0),FALSE)),\"\")","v":""},{"$f":"IFERROR(IF(VLOOKUP(P$16&$M$17&$M20,Data!$D:$X,MATCH(Login_Report!P$15,Data!$D$4:$X$4,0),FALSE)=0,\"\",VLOOKUP(P$16&$M$17&$M20,Data!$D:$X,MATCH(Login_Report!P$15,Data!$D$4:$X$4,0),FALSE)),\"\")","v":""},{"$f":"IFERROR(IF(VLOOKUP(Q$16&$M$17&$M20,Data!$D:$X,MATCH(Login_Report!Q$15,Data!$D$4:$X$4,0),FALSE)=0,\"\",VLOOKUP(Q$16&$M$17&$M20,Data!$D:$X,MATCH(Login_Report!Q$15,Data!$D$4:$X$4,0),FALSE)),\"\")","v":""},{"$f":"IFERROR(IF(VLOOKUP(R$16&$M$17&$M20,Data!$D:$X,MATCH(Login_Report!R$15,Data!$D$4:$X$4,0),FALSE)=0,\"\",VLOOKUP(R$16&$M$17&$M20,Data!$D:$X,MATCH(Login_Report!R$15,Data!$D$4:$X$4,0),FALSE)),\"\")","v":""},{"$f":"IFERROR(IF(VLOOKUP(S$16&$M$17&$M20,Data!$D:$X,MATCH(Login_Report!S$15,Data!$D$4:$X$4,0),FALSE)=0,\"\",VLOOKUP(S$16&$M$17&$M20,Data!$D:$X,MATCH(Login_Report!S$15,Data!$D$4:$X$4,0),FALSE)),\"\")","v":""},{"$f":"IFERROR(IF(VLOOKUP(T$16&$M$17&$M20,Data!$D:$X,MATCH(Login_Report!T$15,Data!$D$4:$X$4,0),FALSE)=0,\"\",VLOOKUP(T$16&$M$17&$M20,Data!$D:$X,MATCH(Login_Report!T$15,Data!$D$4:$X$4,0),FALSE)),\"\")","v":""},{"$f":"IFERROR(IF(VLOOKUP(U$16&$M$17&$M20,Data!$D:$X,MATCH(Login_Report!U$15,Data!$D$4:$X$4,0),FALSE)=0,\"\",VLOOKUP(U$16&$M$17&$M20,Data!$D:$X,MATCH(Login_Report!U$15,Data!$D$4:$X$4,0),FALSE)),\"\")","v":""},null,{"$f":"IF(SUM(Y20:AE20)=0,\"\",SUM(Y20:AE20))","v":""},null,{"$f":"(IFERROR(IF(B20=1,0,O20-N20),0)*86400/60/60)","v":0},null,0,null,0,null,0,null,{"$f":"IF(AND(AS20<>\"\",AT20=\"\"),1,0)","v":0},null,{"$f":"IF(AND(AU20<>\"\",AV20=\"\"),1,0)","v":0},null,{"$f":"IF(AND(AW20<>\"\",AX20=\"\"),1,0)","v":0},null,{"$f":"IF(AND(AY20<>\"\",AZ20=\"\"),1,0)","v":0},null,null,null,null,{"$f":"IF(Staff!D13=\"\",\"\",Staff!D13)","v":""},{"$f":"IFERROR(IF(VLOOKUP(AS$16&$AR20&$AR$17,Data!$D:$X,MATCH(Login_Report!AS$15,Data!$D$4:$X$4,0),FALSE)=0,\"\",VLOOKUP(AS$16&$AR20&$AR$17,Data!$D:$X,MATCH(Login_Report!AS$15,Data!$D$4:$X$4,0),FALSE)),\"\")","v":""},{"$f":"IFERROR(IF(VLOOKUP(AT$16&$AR20&$AR$17,Data!$D:$X,MATCH(Login_Report!AT$15,Data!$D$4:$X$4,0),FALSE)=0,\"\",VLOOKUP(AT$16&$AR20&$AR$17,Data!$D:$X,MATCH(Login_Report!AT$15,Data!$D$4:$X$4,0),FALSE)),\"\")","v":""},{"$f":"IFERROR(IF(VLOOKUP(AU$16&$AR20&$AR$17,Data!$D:$X,MATCH(Login_Report!AU$15,Data!$D$4:$X$4,0),FALSE)=0,\"\",VLOOKUP(AU$16&$AR20&$AR$17,Data!$D:$X,MATCH(Login_Report!AU$15,Data!$D$4:$X$4,0),FALSE)),\"\")","v":""},{"$f":"IFERROR(IF(VLOOKUP(AV$16&$AR20&$AR$17,Data!$D:$X,MATCH(Login_Report!AV$15,Data!$D$4:$X$4,0),FALSE)=0,\"\",VLOOKUP(AV$16&$AR20&$AR$17,Data!$D:$X,MATCH(Login_Report!AV$15,Data!$D$4:$X$4,0),FALSE)),\"\")","v":""},{"$f":"IFERROR(IF(VLOOKUP(AW$16&$AR20&$AR$17,Data!$D:$X,MATCH(Login_Report!AW$15,Data!$D$4:$X$4,0),FALSE)=0,\"\",VLOOKUP(AW$16&$AR20&$AR$17,Data!$D:$X,MATCH(Login_Report!AW$15,Data!$D$4:$X$4,0),FALSE)),\"\")","v":""},{"$f":"IFERROR(IF(VLOOKUP(AX$16&$AR20&$AR$17,Data!$D:$X,MATCH(Login_Report!AX$15,Data!$D$4:$X$4,0),FALSE)=0,\"\",VLOOKUP(AX$16&$AR20&$AR$17,Data!$D:$X,MATCH(Login_Report!AX$15,Data!$D$4:$X$4,0),FALSE)),\"\")","v":""},{"$f":"IFERROR(IF(VLOOKUP(AY$16&$AR20&$AR$17,Data!$D:$X,MATCH(Login_Report!AY$15,Data!$D$4:$X$4,0),FALSE)=0,\"\",VLOOKUP(AY$16&$AR20&$AR$17,Data!$D:$X,MATCH(Login_Report!AY$15,Data!$D$4:$X$4,0),FALSE)),\"\")","v":""},{"$f":"IFERROR(IF(VLOOKUP(AZ$16&$AR20&$AR$17,Data!$D:$X,MATCH(Login_Report!AZ$15,Data!$D$4:$X$4,0),FALSE)=0,\"\",VLOOKUP(AZ$16&$AR20&$AR$17,Data!$D:$X,MATCH(Login_Report!AZ$15,Data!$D$4:$X$4,0),FALSE)),\"\")","v":""},null,{"$f":"IF(SUM(BD20:BJ20)=0,\"\",SUM(BD20:BJ20))","v":""},null,{"$f":"(IFERROR(IF(AG20=1,0,AT20-AS20),0)*86400/60/60)","v":0},null,{"$f":"(IFERROR(IF(AI20=1,0,AV20-AU20),0)*86400/60/60)","v":0},null,{"$f":"(IFERROR(IF(AK20=1,0,AX20-AW20),0)*86400/60/60)","v":0},null,{"$f":"(IFERROR(IF(AM20=1,0,AZ20-AY20),0)*86400/60/60)","v":0}]
[null,{"$f":"IF(AND(N21<>\"\",O21=\"\"),1,0)","v":0},null,{"$f":"IF(AND(P21<>\"\",Q21=\"\"),1,0)","v":0},null,{"$f":"IF(AND(R21<>\"\",S21=\"\"),1,0)","v":0},null,{"$f":"IF(AND(T21<>\"\",U21=\"\"),1,0)","v":0},{"$f":"IF(J21>$L$16,\".\",I20+1)","v":"2017-09-17"},2,null,null,{"$f":"IF($D$15=\"OK\",I21,\"\")","v":"2017-09-17"},{"$f":"IFERROR(IF(VLOOKUP(N$16&$M$17&$M21,Data!$D:$X,MATCH(Login_Report!N$15,Data!$D$4:$X$4,0),FALSE)=0,\"\",VLOOKUP(N$16&$M$17&$M21,Data!$D:$X,MATCH(Login_Report!N$15,Data!$D$4:$X$4,0),FALSE)),\"\")","v":""},{"$f":"IFERROR(IF(VLOOKUP(O$16&$M$17&$M21,Data!$D:$X,MATCH(Login_Report!O$15,Data!$D$4:$X$4,0),FALSE)=0,\"\",VLOOKUP(O$16&$M$17&$M21,Data!$D:$X,MATCH(Login_Report!O$15,Data!$D$4:$X$4,0),FALSE)),\"\")","v":""},{"$f":"IFERROR(IF(VLOOKUP(P$16&$M$17&$M21,Data!$D:$X,MATCH(Login_Report!P$15,Data!$D$4:$X$4,0),FALSE)=0,\"\",VLOOKUP(P$16&$M$17&$M21,Data!$D:$X,MATCH(Login_Report!P$15,Data!$D$4:$X$4,0),FALSE)),\"\")","v":""},{"$f":"IFERROR(IF(VLOOKUP(Q$16&$M$17&$M21,Data!$D:$X,MATCH(Login_Report!Q$15,Data!$D$4:$X$4,0),FALSE)=0,\"\",VLOOKUP(Q$16&$M$17&$M21,Data!$D:$X,MATCH(Login_Report!Q$15,Data!$D$4:$X$4,0),FALSE)),\"\")","v":""},{"$f":"IFERROR(IF(VLOOKUP(R$16&$M$17&$M21,Data!$D:$X,MATCH(Login_Report!R$15,Data!$D$4:$X$4,0),FALSE)=0,\"\",VLOOKUP(R$16&$M$17&$M21,Data!$D:$X,MATCH(Login_Report!R$15,Data!$D$4:$X$4,0),FALSE)),\"\")","v":""},{"$f":"IFERROR(IF(VLOOKUP(S$16&$M$17&$M21,Data!$D:$X,MATCH(Login_Report!S$15,Data!$D$4:$X$4,0),FALSE)=0,\"\",VLOOKUP(S$16&$M$17&$M21,Data!$D:$X,MATCH(Login_Report!S$15,Data!$D$4:$X$4,0),FALSE)),\"\")","v":""},{"$f":"IFERROR(IF(VLOOKUP(T$16&$M$17&$M21,Data!$D:$X,MATCH(Login_Report!T$15,Data!$D$4:$X$4,0),FALSE)=0,\"\",VLOOKUP(T$16&$M$17&$M21,Data!$D:$X,MATCH(Login_Report!T$15,Data!$D$4:$X$4,0),FALSE)),\"\")","v":""},{"$f":"IFERROR(IF(VLOOKUP(U$16&$M$17&$M21,Data!$D:$X,MATCH(Login_Report!U$15,Data!$D$4:$X$4,0),FALSE)=0,\"\",VLOOKUP(U$16&$M$17&$M21,Data!$D:$X,MATCH(Login_Report!U$15,Data!$D$4:$X$4,0),FALSE)),\"\")","v":""},null,{"$f":"IF(SUM(Y21:AE21)=0,\"\",SUM(Y21:AE21))","v":""},null,0,null,0,null,0,null,0,null,{"$f":"IF(AND(AS21<>\"\",AT21=\"\"),1,0)","v":0},null,{"$f":"IF(AND(AU21<>\"\",AV21=\"\"),1,0)","v":0},null,{"$f":"IF(AND(AW21<>\"\",AX21=\"\"),1,0)","v":0},null,{"$f":"IF(AND(AY21<>\"\",AZ21=\"\"),1,0)","v":0},null,null,null,null,{"$f":"IF(Staff!D14=\"\",\"\",Staff!D14)","v":""},{"$f":"IFERROR(IF(VLOOKUP(AS$16&$AR21&$AR$17,Data!$D:$X,MATCH(Login_Report!AS$15,Data!$D$4:$X$4,0),FALSE)=0,\"\",VLOOKUP(AS$16&$AR21&$AR$17,Data!$D:$X,MATCH(Login_Report!AS$15,Data!$D$4:$X$4,0),FALSE)),\"\")","v":""},{"$f":"IFERROR(IF(VLOOKUP(AT$16&$AR21&$AR$17,Data!$D:$X,MATCH(Login_Report!AT$15,Data!$D$4:$X$4,0),FALSE)=0,\"\",VLOOKUP(AT$16&$AR21&$AR$17,Data!$D:$X,MATCH(Login_Report!AT$15,Data!$D$4:$X$4,0),FALSE)),\"\")","v":""},{"$f":"IFERROR(IF(VLOOKUP(AU$16&$AR21&$AR$17,Data!$D:$X,MATCH(Login_Report!AU$15,Data!$D$4:$X$4,0),FALSE)=0,\"\",VLOOKUP(AU$16&$AR21&$AR$17,Data!$D:$X,MATCH(Login_Report!AU$15,Data!$D$4:$X$4,0),FALSE)),\"\")","v":""},{"$f":"IFERROR(IF(VLOOKUP(AV$16&$AR21&$AR$17,Data!$D:$X,MATCH(Login_Report!AV$15,Data!$D$4:$X$4,0),FALSE)=0,\"\",VLOOKUP(AV$16&$AR21&$AR$17,Data!$D:$X,MATCH(Login_Report!AV$15,Data!$D$4:$X$4,0),FALSE)),\"\")","v":""},{"$f":"IFERROR(IF(VLOOKUP(AW$16&$AR21&$AR$17,Data!$D:$X,MATCH(Login_Report!AW$15,Data!$D$4:$X$4,0),FALSE)=0,\"\",VLOOKUP(AW$16&$AR21&$AR$17,Data!$D:$X,MATCH(Login_Report!AW$15,Data!$D$4:$X$4,0),FALSE)),\"\")","v":""},{"$f":"IFERROR(IF(VLOOKUP(AX$16&$AR21&$AR$17,Data!$D:$X,MATCH(Login_Report!AX$15,Data!$D$4:$X$4,0),FALSE)=0,\"\",VLOOKUP(AX$16&$AR21&$AR$17,Data!$D:$X,MATCH(Login_Report!AX$15,Data!$D$4:$X$4,0),FALSE)),\"\")","v":""},{"$f":"IFERROR(IF(VLOOKUP(AY$16&$AR21&$AR$17,Data!$D:$X,MATCH(Login_Report!AY$15,Data!$D$4:$X$4,0),FALSE)=0,\"\",VLOOKUP(AY$16&$AR21&$AR$17,Data!$D:$X,MATCH(Login_Report!AY$15,Data!$D$4:$X$4,0),FALSE)),\"\")","v":""},{"$f":"IFERROR(IF(VLOOKUP(AZ$16&$AR21&$AR$17,Data!$D:$X,MATCH(Login_Report!AZ$15,Data!$D$4:$X$4,0),FALSE)=0,\"\",VLOOKUP(AZ$16&$AR21&$AR$17,Data!$D:$X,MATCH(Login_Report!AZ$15,Data!$D$4:$X$4,0),FALSE)),\"\")","v":""},null,{"$f":"IF(SUM(BD21:BJ21)=0,\"\",SUM(BD21:BJ21))","v":""},null,0,null,0,null,0,null,0]
[null,0,null,0,null,0,null,0,"2017-09-18",3,null,null,"2017-09-18",{"$f":"IFERROR(IF(VLOOKUP(N$16&$M$17&$M22,Data!$D:$X,MATCH(Login_Report!N$15,Data!$D$4:$X$4,0),FALSE)=0,\"\",VLOOKUP(N$16&$M$17&$M22,Data!$D:$X,MATCH(Login_Report!N$15,Data!$D$4:$X$4,0),FALSE)),\"\")","v":""},{"$f":"IFERROR(IF(VLOOKUP(O$16&$M$17&$M22,Data!$D:$X,MATCH(Login_Report!O$15,Data!$D$4:$X$4,0),FALSE)=0,\"\",VLOOKUP(O$16&$M$17&$M22,Data!$D:$X,MATCH(Login_Report!O$15,Data!$D$4:$X$4,0),FALSE)),\"\")","v":""},{"$f":"IFERROR(IF(VLOOKUP(P$16&$M$17&$M22,Data!$D:$X,MATCH(Login_Report!P$15,Data!$D$4:$X$4,0),FALSE)=0,\"\",VLOOKUP(P$16&$M$17&$M22,Data!$D:$X,MATCH(Login_Report!P$15,Data!$D$4:$X$4,0),FALSE)),\"\")","v":""},{"$f":"IFERROR(IF(VLOOKUP(Q$16&$M$17&$M22,Data!$D:$X,MATCH(Login_Report!Q$15,Data!$D$4:$X$4,0),FALSE)=0,\"\",VLOOKUP(Q$16&$M$17&$M22,Data!$D:$X,MATCH(Login_Report!Q$15,Data!$D$4:$X$4,0),FALSE)),\"\")","v":""},{"$f":"IFERROR(IF(VLOOKUP(R$16&$M$17&$M22,Data!$D:$X,MATCH(Login_Report!R$15,Data!$D$4:$X$4,0),FALSE)=0,\"\",VLOOKUP(R$16&$M$17&$M22,Data!$D:$X,MATCH(Login_Report!R$15,Data!$D$4:$X$4,0),FALSE)),\"\")","v":""},{"$f":"IFERROR(IF(VLOOKUP(S$16&$M$17&$M22,Data!$D:$X,MATCH(Login_Report!S$15,Data!$D$4:$X$4,0),FALSE)=0,\"\",VLOOKUP(S$16&$M$17&$M22,Data!$D:$X,MATCH(Login_Report!S$15,Data!$D$4:$X$4,0),FALSE)),\"\")","v":""},{"$f":"IFERROR(IF(VLOOKUP(T$16&$M$17&$M22,Data!$D:$X,MATCH(Login_Report!T$15,Data!$D$4:$X$4,0),FALSE)=0,\"\",VLOOKUP(T$16&$M$17&$M22,Data!$D:$X,MATCH(Login_Report!T$15,Data!$D$4:$X$4,0),FALSE)),\"\")","v":""},{"$f":"IFERROR(IF(VLOOKUP(U$16&$M$17&$M22,Data!$D:$X,MATCH(Login_Report!U$15,Data!$D$4:$X$4,0),FALSE)=0,\"\",VLOOKUP(U$16&$M$17&$M22,Data!$D:$X,MATCH(Login_Report!U$15,Data!$D$4:$X$4,0),FALSE)),\"\")","v":""},null,{"$f":"IF(SUM(Y22:AE22)=0,\"\",SUM(Y22:AE22))","v":""},null,{"$f":"(IFERROR(IF(B22=1,0,O22-N22),0)*86400/60/60)","v":0},null,{"$f":"(IFERROR(IF(D22=1,0,Q22-P22),0)*86400/60/60)","v":0},null,{"$f":"(IFERROR(IF(F22=1,0,S22-R22),0)*86400/60/60)","v":0},null,{"$f":"(IFERROR(IF(H22=1,0,U22-T22),0)*86400/60/60)","v":0},null,0,null,0,null,0,null,0,null,null,null,null,{"$f":"IF(Staff!D15=\"\",\"\",Staff!D15)","v":""},{"$f":"IFERROR(IF(VLOOKUP(AS$16&$AR22&$AR$17,Data!$D:$X,MATCH(Login_Report!AS$15,Data!$D$4:$X$4,0),FALSE)=0,\"\",VLOOKUP(AS$16&$AR22&$AR$17,Data!$D:$X,MATCH(Login_Report!AS$15,Data!$D$4:$X$4,0),FALSE)),\"\")","v":""},{"$f":"IFERROR(IF(VLOOKUP(AT$16&$AR22&$AR$17,Data!$D:$X,MATCH(Login_Report!AT$15,Data!$D$4:$X$4,0),FALSE)=0,\"\",VLOOKUP(AT$16&$AR22&$AR$17,Data!$D:$X,MATCH(Login_Report!AT$15,Data!$D$4:$X$4,0),FALSE)),\"\")","v":""},{"$f":"IFERROR(IF(VLOOKUP(AU$16&$AR22&$AR$17,Data!$D:$X,MATCH(Login_Report!AU$15,Data!$D$4:$X$4,0),FALSE)=0,\"\",VLOOKUP(AU$16&$AR22&$AR$17,Data!$D:$X,MATCH(Login_Report!AU$15,Data!$D$4:$X$4,0),FALSE)),\"\")","v":""},{"$f":"IFERROR(IF(VLOOKUP(AV$16&$AR22&$AR$17,Data!$D:$X,MATCH(Login_Report!AV$15,Data!$D$4:$X$4,0),FALSE)=0,\"\",VLOOKUP(AV$16&$AR22&$AR$17,Data!$D:$X,MATCH(Login_Report!AV$15,Data!$D$4:$X$4,0),FALSE)),\"\")","v":""},{"$f":"IFERROR(IF(VLOOKUP(AW$16&$AR22&$AR$17,Data!$D:$X,MATCH(Login_Report!AW$15,Data!$D$4:$X$4,0),FALSE)=0,\"\",VLOOKUP(AW$16&$AR22&$AR$17,Data!$D:$X,MATCH(Login_Report!AW$15,Data!$D$4:$X$4,0),FALSE)),\"\")","v":""},{"$f":"IFERROR(IF(VLOOKUP(AX$16&$AR22&$AR$17,Data!$D:$X,MATCH(Login_Report!AX$15,Data!$D$4:$X$4,0),FALSE)=0,\"\",VLOOKUP(AX$16&$AR22&$AR$17,Data!$D:$X,MATCH(Login_Report!AX$15,Data!$D$4:$X$4,0),FALSE)),\"\")","v":""},{"$f":"IFERROR(IF(VLOOKUP(AY$16&$AR22&$AR$17,Data!$D:$X,MATCH(Login_Report!AY$15,Data!$D$4:$X$4,0),FALSE)=0,\"\",VLOOKUP(AY$16&$AR22&$AR$17,Data!$D:$X,MATCH(Login_Report!AY$15,Data!$D$4:$X$4,0),FALSE)),\"\")","v":""},{"$f":"IFERROR(IF(VLOOKUP(AZ$16&$AR22&$AR$17,Data!$D:$X,MATCH(Login_Report!AZ$15,Data!$D$4:$X$4,0),FALSE)=0,\"\",VLOOKUP(AZ$16&$AR22&$AR$17,Data!$D:$X,MATCH(Login_Report!AZ$15,Data!$D$4:$X$4,0),FALSE)),\"\")","v":""},null,"",null,0,null,0,null,0,null,0]
[null,0,null,0,null,0,null,0,"2017-09-19",4,null,null,"2017-09-19",{"$f":"IFERROR(IF(VLOOKUP(N$16&$M$17&$M23,Data!$D:$X,MATCH(Login_Report!N$15,Data!$D$4:$X$4,0),FALSE)=0,\"\",VLOOKUP(N$16&$M$17&$M23,Data!$D:$X,MATCH(Login_Report!N$15,Data!$D$4:$X$4,0),FALSE)),\"\")","v":""},{"$f":"IFERROR(IF(VLOOKUP(O$16&$M$17&$M23,Data!$D:$X,MATCH(Login_Report!O$15,Data!$D$4:$X$4,0),FALSE)=0,\"\",VLOOKUP(O$16&$M$17&$M23,Data!$D:$X,MATCH(Login_Report!O$15,Data!$D$4:$X$4,0),FALSE)),\"\")","v":""},{"$f":"IFERROR(IF(VLOOKUP(P$16&$M$17&$M23,Data!$D:$X,MATCH(Login_Report!P$15,Data!$D$4:$X$4,0),FALSE)=0,\"\",VLOOKUP(P$16&$M$17&$M23,Data!$D:$X,MATCH(Login_Report!P$15,Data!$D$4:$X$4,0),FALSE)),\"\")","v":""},{"$f":"IFERROR(IF(VLOOKUP(Q$16&$M$17&$M23,Data!$D:$X,MATCH(Login_Report!Q$15,Data!$D$4:$X$4,0),FALSE)=0,\"\",VLOOKUP(Q$16&$M$17&$M23,Data!$D:$X,MATCH(Login_Report!Q$15,Data!$D$4:$X$4,0),FALSE)),\"\")","v":""},{"$f":"IFERROR(IF(VLOOKUP(R$16&$M$17&$M23,Data!$D:$X,MATCH(Login_Report!R$15,Data!$D$4:$X$4,0),FALSE)=0,\"\",VLOOKUP(R$16&$M$17&$M23,Data!$D:$X,MATCH(Login_Report!R$15,Data!$D$4:$X$4,0),FALSE)),\"\")","v":""},{"$f":"IFERROR(IF(VLOOKUP(S$16&$M$17&$M23,Data!$D:$X,MATCH(Login_Report!S$15,Data!$D$4:$X$4,0),FALSE)=0,\"\",VLOOKUP(S$16&$M$17&$M23,Data!$D:$X,MATCH(Login_Report!S$15,Data!$D$4:$X$4,0),FALSE)),\"\")","v":""},{"$f":"IFERROR(IF(VLOOKUP(T$16&$M$17&$M23,Data!$D:$X,MATCH(Login_Report!T$15,Data!$D$4:$X$4,0),FALSE)=0,\"\",VLOOKUP(T$16&$M$17&$M23,Data!$D:$X,MATCH(Login_Report!T$15,Data!$D$4:$X$4,0),FALSE)),\"\")","v":""},{"$f":"IFERROR(IF(VLOOKUP(U$16&$M$17&$M23,Data!$D:$X,MATCH(Login_Report!U$15,Data!$D$4:$X$4,0),FALSE)=0,\"\",VLOOKUP(U$16&$M$17&$M23,Data!$D:$X,MATCH(Login_Report!U$15,Data!$D$4:$X$4,0),FALSE)),\"\")","v":""},null,"",null,0,null,0,null,0,null,0,null,0,null,0,null,0,null,0,null,null,null,null,{"$f":"IF(Staff!D16=\"\",\"\",Staff!D16)","v":""},{"$f":"IFERROR(IF(VLOOKUP(AS$16&$AR23&$AR$17,Data!$D:$X,MATCH(Login_Report!AS$15,Data!$D$4:$X$4,0),FALSE)=0,\"\",VLOOKUP(AS$16&$AR23&$AR$17,Data!$D:$X,MATCH(Login_Report!AS$15,Data!$D$4:$X$4,0),FALSE)),\"\")","v":""},{"$f":"IFERROR(IF(VLOOKUP(AT$16&$AR23&$AR$17,Data!$D:$X,MATCH(Login_Report!AT$15,Data!$D$4:$X$4,0),FALSE)=0,\"\",VLOOKUP(AT$16&$AR23&$AR$17,Data!$D:$X,MATCH(Login_Report!AT$15,Data!$D$4:$X$4,0),FALSE)),\"\")","v":""},{"$f":"IFERROR(IF(VLOOKUP(AU$16&$AR23&$AR$17,Data!$D:$X,MATCH(Login_Report!AU$15,Data!$D$4:$X$4,0),FALSE)=0,\"\",VLOOKUP(AU$16&$AR23&$AR$17,Data!$D:$X,MATCH(Login_Report!AU$15,Data!$D$4:$X$4,0),FALSE)),\"\")","v":""},{"$f":"IFERROR(IF(VLOOKUP(AV$16&$AR23&$AR$17,Data!$D:$X,MATCH(Login_Report!AV$15,Data!$D$4:$X$4,0),FALSE)=0,\"\",VLOOKUP(AV$16&$AR23&$AR$17,Data!$D:$X,MATCH(Login_Report!AV$15,Data!$D$4:$X$4,0),FALSE)),\"\")","v":""},{"$f":"IFERROR(IF(VLOOKUP(AW$16&$AR23&$AR$17,Data!$D:$X,MATCH(Login_Report!AW$15,Data!$D$4:$X$4,0),FALSE)=0,\"\",VLOOKUP(AW$16&$AR23&$AR$17,Data!$D:$X,MATCH(Login_Report!AW$15,Data!$D$4:$X$4,0),FALSE)),\"\")","v":""},{"$f":"IFERROR(IF(VLOOKUP(AX$16&$AR23&$AR$17,Data!$D:$X,MATCH(Login_Report!AX$15,Data!$D$4:$X$4,0),FALSE)=0,\"\",VLOOKUP(AX$16&$AR23&$AR$17,Data!$D:$X,MATCH(Login_Report!AX$15,Data!$D$4:$X$4,0),FALSE)),\"\")","v":""},{"$f":"IFERROR(IF(VLOOKUP(AY$16&$AR23&$AR$17,Data!$D:$X,MATCH(Login_Report!AY$15,Data!$D$4:$X$4,0),FALSE)=0,\"\",VLOOKUP(AY$16&$AR23&$AR$17,Data!$D:$X,MATCH(Login_Report!AY$15,Data!$D$4:$X$4,0),FALSE)),\"\")","v":""},{"$f":"IFERROR(IF(VLOOKUP(AZ$16&$AR23&$AR$17,Data!$D:$X,MATCH(Login_Report!AZ$15,Data!$D$4:$X$4,0),FALSE)=0,\"\",VLOOKUP(AZ$16&$AR23&$AR$17,Data!$D:$X,MATCH(Login_Report!AZ$15,Data!$D$4:$X$4,0),FALSE)),\"\")","v":""},null,"",null,0,null,0,null,0,null,0]
[null,0,null,0,null,0,null,0,"2017-09-20",5,null,null,"2017-09-20",{"$f":"IFERROR(IF(VLOOKUP(N$16&$M$17&$M24,Data!$D:$X,MATCH(Login_Report!N$15,Data!$D$4:$X$4,0),FALSE)=0,\"\",VLOOKUP(N$16&$M$17&$M24,Data!$D:$X,MATCH(Login_Report!N$15,Data!$D$4:$X$4,0),FALSE)),\"\")","v":""},{"$f":"IFERROR(IF(VLOOKUP(O$16&$M$17&$M24,Data!$D:$X,MATCH(Login_Report!O$15,Data!$D$4:$X$4,0),FALSE)=0,\"\",VLOOKUP(O$16&$M$17&$M24,Data!$D:$X,MATCH(Login_Report!O$15,Data!$D$4:$X$4,0),FALSE)),\"\")","v":""},{"$f":"IFERROR(IF(VLOOKUP(P$16&$M$17&$M24,Data!$D:$X,MATCH(Login_Report!P$15,Data!$D$4:$X$4,0),FALSE)=0,\"\",VLOOKUP(P$16&$M$17&$M24,Data!$D:$X,MATCH(Login_Report!P$15,Data!$D$4:$X$4,0),FALSE)),\"\")","v":""},{"$f":"IFERROR(IF(VLOOKUP(Q$16&$M$17&$M24,Data!$D:$X,MATCH(Login_Report!Q$15,Data!$D$4:$X$4,0),FALSE)=0,\"\",VLOOKUP(Q$16&$M$17&$M24,Data!$D:$X,MATCH(Login_Report!Q$15,Data!$D$4:$X$4,0),FALSE)),\"\")","v":""},{"$f":"IFERROR(IF(VLOOKUP(R$16&$M$17&$M24,Data!$D:$X,MATCH(Login_Report!R$15,Data!$D$4:$X$4,0),FALSE)=0,\"\",VLOOKUP(R$16&$M$17&$M24,Data!$D:$X,MATCH(Login_Report!R$15,Data!$D$4:$X$4,0),FALSE)),\"\")","v":""},{"$f":"IFERROR(IF(VLOOKUP(S$16&$M$17&$M24,Data!$D:$X,MATCH(Login_Report!S$15,Data!$D$4:$X$4,0),FALSE)=0,\"\",VLOOKUP(S$16&$M$17&$M24,Data!$D:$X,MATCH(Login_Report!S$15,Data!$D$4:$X$4,0),FALSE)),\"\")","v":""},{"$f":"IFERROR(IF(VLOOKUP(T$16&$M$17&$M24,Data!$D:$X,MATCH(Login_Report!T$15,Data!$D$4:$X$4,0),FALSE)=0,\"\",VLOOKUP(T$16&$M$17&$M24,Data!$D:$X,MATCH(Login_Report!T$15,Data!$D$4:$X$4,0),FALSE)),\"\")","v":""},{"$f":"IFERROR(IF(VLOOKUP(U$16&$M$17&$M24,Data!$D:$X,MATCH(Login_Report!U$15,Data!$D$4:$X$4,0),FALSE)=0,\"\",VLOOKUP(U$16&$M$17&$M24,Data!$D:$X,MATCH(Login_Report!U$15,Data!$D$4:$X$4,0),FALSE)),\"\")","v":""},null,"",null,0,null,0,null,0,null,0,null,0,null,0,null,0,null,0,null,null,null,null,{"$f":"IF(Staff!D17=\"\",\"\",Staff!D17)","v":""},{"$f":"IFERROR(IF(VLOOKUP(AS$16&$AR24&$AR$17,Data!$D:$X,MATCH(Login_Report!AS$15,Data!$D$4:$X$4,0),FALSE)=0,\"\",VLOOKUP(AS$16&$AR24&$AR$17,Data!$D:$X,MATCH(Login_Report!AS$15,Data!$D$4:$X$4,0),FALSE)),\"\")","v":""},{"$f":"IFERROR(IF(VLOOKUP(AT$16&$AR24&$AR$17,Data!$D:$X,MATCH(Login_Report!AT$15,Data!$D$4:$X$4,0),FALSE)=0,\"\",VLOOKUP(AT$16&$AR24&$AR$17,Data!$D:$X,MATCH(Login_Report!AT$15,Data!$D$4:$X$4,0),FALSE)),\"\")","v":""},{"$f":"IFERROR(IF(VLOOKUP(AU$16&$AR24&$AR$17,Data!$D:$X,MATCH(Login_Report!AU$15,Data!$D$4:$X$4,0),FALSE)=0,\"\",VLOOKUP(AU$16&$AR24&$AR$17,Data!$D:$X,MATCH(Login_Report!AU$15,Data!$D$4:$X$4,0),FALSE)),\"\")","v":""},{"$f":"IFERROR(IF(VLOOKUP(AV$16&$AR24&$AR$17,Data!$D:$X,MATCH(Login_Report!AV$15,Data!$D$4:$X$4,0),FALSE)=0,\"\",VLOOKUP(AV$16&$AR24&$AR$17,Data!$D:$X,MATCH(Login_Report!AV$15,Data!$D$4:$X$4,0),FALSE)),\"\")","v":""},{"$f":"IFERROR(IF(VLOOKUP(AW$16&$AR24&$AR$17,Data!$D:$X,MATCH(Login_Report!AW$15,Data!$D$4:$X$4,0),FALSE)=0,\"\",VLOOKUP(AW$16&$AR24&$AR$17,Data!$D:$X,MATCH(Login_Report!AW$15,Data!$D$4:$X$4,0),FALSE)),\"\")","v":""},{"$f":"IFERROR(IF(VLOOKUP(AX$16&$AR24&$AR$17,Data!$D:$X,MATCH(Login_Report!AX$15,Data!$D$4:$X$4,0),FALSE)=0,\"\",VLOOKUP(AX$16&$AR24&$AR$17,Data!$D:$X,MATCH(Login_Report!AX$15,Data!$D$4:$X$4,0),FALSE)),\"\")","v":""},{"$f":"IFERROR(IF(VLOOKUP(AY$16&$AR24&$AR$17,Data!$D:$X,MATCH(Login_Report!AY$15,Data!$D$4:$X$4,0),FALSE)=0,\"\",VLOOKUP(AY$16&$AR24&$AR$17,Data!$D:$X,MATCH(Login_Report!AY$15,Data!$D$4:$X$4,0),FALSE)),\"\")","v":""},{"$f":"IFERROR(IF(VLOOKUP(AZ$16&$AR24&$AR$17,Data!$D:$X,MATCH(Login_Report!AZ$15,Data!$D$4:$X$4,0),FALSE)=0,\"\",VLOOKUP(AZ$16&$AR24&$AR$17,Data!$D:$X,MATCH(Login_Report!AZ$15,Data!$D$4:$X$4,0),FALSE)),\"\")","v":""},null,"",null,0,null,0,null,0,null,0]
[null,0,null,0,null,0,null,0,"2017-09-21",6,null,null,"2017-09-21",{"$f":"IFERROR(IF(VLOOKUP(N$16&$M$17&$M25,Data!$D:$X,MATCH(Login_Report!N$15,Data!$D$4:$X$4,0),FALSE)=0,\"\",VLOOKUP(N$16&$M$17&$M25,Data!$D:$X,MATCH(Login_Report!N$15,Data!$D$4:$X$4,0),FALSE)),\"\")","v":""},{"$f":"IFERROR(IF(VLOOKUP(O$16&$M$17&$M25,Data!$D:$X,MATCH(Login_Report!O$15,Data!$D$4:$X$4,0),FALSE)=0,\"\",VLOOKUP(O$16&$M$17&$M25,Data!$D:$X,MATCH(Login_Report!O$15,Data!$D$4:$X$4,0),FALSE)),\"\")","v":""},{"$f":"IFERROR(IF(VLOOKUP(P$16&$M$17&$M25,Data!$D:$X,MATCH(Login_Report!P$15,Data!$D$4:$X$4,0),FALSE)=0,\"\",VLOOKUP(P$16&$M$17&$M25,Data!$D:$X,MATCH(Login_Report!P$15,Data!$D$4:$X$4,0),FALSE)),\"\")","v":""},{"$f":"IFERROR(IF(VLOOKUP(Q$16&$M$17&$M25,Data!$D:$X,MATCH(Login_Report!Q$15,Data!$D$4:$X$4,0),FALSE)=0,\"\",VLOOKUP(Q$16&$M$17&$M25,Data!$D:$X,MATCH(Login_Report!Q$15,Data!$D$4:$X$4,0),FALSE)),\"\")","v":""},{"$f":"IFERROR(IF(VLOOKUP(R$16&$M$17&$M25,Data!$D:$X,MATCH(Login_Report!R$15,Data!$D$4:$X$4,0),FALSE)=0,\"\",VLOOKUP(R$16&$M$17&$M25,Data!$D:$X,MATCH(Login_Report!R$15,Data!$D$4:$X$4,0),FALSE)),\"\")","v":""},{"$f":"IFERROR(IF(VLOOKUP(S$16&$M$17&$M25,Data!$D:$X,MATCH(Login_Report!S$15,Data!$D$4:$X$4,0),FALSE)=0,\"\",VLOOKUP(S$16&$M$17&$M25,Data!$D:$X,MATCH(Login_Report!S$15,Data!$D$4:$X$4,0),FALSE)),\"\")","v":""},{"$f":"IFERROR(IF(VLOOKUP(T$16&$M$17&$M25,Data!$D:$X,MATCH(Login_Report!T$15,Data!$D$4:$X$4,0),FALSE)=0,\"\",VLOOKUP(T$16&$M$17&$M25,Data!$D:$X,MATCH(Login_Report!T$15,Data!$D$4:$X$4,0),FALSE)),\"\")","v":""},{"$f":"IFERROR(IF(VLOOKUP(U$16&$M$17&$M25,Data!$D:$X,MATCH(Login_Report!U$15,Data!$D$4:$X$4,0),FALSE)=0,\"\",VLOOKUP(U$16&$M$17&$M25,Data!$D:$X,MATCH(Login_Report!U$15,Data!$D$4:$X$4,0),FALSE)),\"\")","v":""},null,"",null,0,null,0,null,0,null,0,null,0,null,0,null,0,null,0,null,null,null,null,{"$f":"IF(Staff!D18=\"\",\"\",Staff!D18)","v":""},{"$f":"IFERROR(IF(VLOOKUP(AS$16&$AR25&$AR$17,Data!$D:$X,MATCH(Login_Report!AS$15,Data!$D$4:$X$4,0),FALSE)=0,\"\",VLOOKUP(AS$16&$AR25&$AR$17,Data!$D:$X,MATCH(Login_Report!AS$15,Data!$D$4:$X$4,0),FALSE)),\"\")","v":""},{"$f":"IFERROR(IF(VLOOKUP(AT$16&$AR25&$AR$17,Data!$D:$X,MATCH(Login_Report!AT$15,Data!$D$4:$X$4,0),FALSE)=0,\"\",VLOOKUP(AT$16&$AR25&$AR$17,Data!$D:$X,MATCH(Login_Report!AT$15,Data!$D$4:$X$4,0),FALSE)),\"\")","v":""},{"$f":"IFERROR(IF(VLOOKUP(AU$16&$AR25&$AR$17,Data!$D:$X,MATCH(Login_Report!AU$15,Data!$D$4:$X$4,0),FALSE)=0,\"\",VLOOKUP(AU$16&$AR25&$AR$17,Data!$D:$X,MATCH(Login_Report!AU$15,Data!$D$4:$X$4,0),FALSE)),\"\")","v":""},{"$f":"IFERROR(IF(VLOOKUP(AV$16&$AR25&$AR$17,Data!$D:$X,MATCH(Login_Report!AV$15,Data!$D$4:$X$4,0),FALSE)=0,\"\",VLOOKUP(AV$16&$AR25&$AR$17,Data!$D:$X,MATCH(Login_Report!AV$15,Data!$D$4:$X$4,0),FALSE)),\"\")","v":""},{"$f":"IFERROR(IF(VLOOKUP(AW$16&$AR25&$AR$17,Data!$D:$X,MATCH(Login_Report!AW$15,Data!$D$4:$X$4,0),FALSE)=0,\"\",VLOOKUP(AW$16&$AR25&$AR$17,Data!$D:$X,MATCH(Login_Report!AW$15,Data!$D$4:$X$4,0),FALSE)),\"\")","v":""},{"$f":"IFERROR(IF(VLOOKUP(AX$16&$AR25&$AR$17,Data!$D:$X,MATCH(Login_Report!AX$15,Data!$D$4:$X$4,0),FALSE)=0,\"\",VLOOKUP(AX$16&$AR25&$AR$17,Data!$D:$X,MATCH(Login_Report!AX$15,Data!$D$4:$X$4,0),FALSE)),\"\")","v":""},{"$f":"IFERROR(IF(VLOOKUP(AY$16&$AR25&$AR$17,Data!$D:$X,MATCH(Login_Report!AY$15,Data!$D$4:$X$4,0),FALSE)=0,\"\",VLOOKUP(AY$16&$AR25&$AR$17,Data!$D:$X,MATCH(Login_Report!AY$15,Data!$D$4:$X$4,0),FALSE)),\"\")","v":""},{"$f":"IFERROR(IF(VLOOKUP(AZ$16&$AR25&$AR$17,Data!$D:$X,MATCH(Login_Report!AZ$15,Data!$D$4:$X$4,0),FALSE)=0,\"\",VLOOKUP(AZ$16&$AR25&$AR$17,Data!$D:$X,MATCH(Login_Report!AZ$15,Data!$D$4:$X$4,0),FALSE)),\"\")","v":""},null,"",null,0,null,0,null,0,null,0]
[null,0,null,0,null,0,null,0,"2017-09-22",7,null,null,"2017-09-22",{"$f":"IFERROR(IF(VLOOKUP(N$16&$M$17&$M26,Data!$D:$X,MATCH(Login_Report!N$15,Data!$D$4:$X$4,0),FALSE)=0,\"\",VLOOKUP(N$16&$M$17&$M26,Data!$D:$X,MATCH(Login_Report!N$15,Data!$D$4:$X$4,0),FALSE)),\"\")","v":""},{"$f":"IFERROR(IF(VLOOKUP(O$16&$M$17&$M26,Data!$D:$X,MATCH(Login_Report!O$15,Data!$D$4:$X$4,0),FALSE)=0,\"\",VLOOKUP(O$16&$M$17&$M26,Data!$D:$X,MATCH(Login_Report!O$15,Data!$D$4:$X$4,0),FALSE)),\"\")","v":""},{"$f":"IFERROR(IF(VLOOKUP(P$16&$M$17&$M26,Data!$D:$X,MATCH(Login_Report!P$15,Data!$D$4:$X$4,0),FALSE)=0,\"\",VLOOKUP(P$16&$M$17&$M26,Data!$D:$X,MATCH(Login_Report!P$15,Data!$D$4:$X$4,0),FALSE)),\"\")","v":""},{"$f":"IFERROR(IF(VLOOKUP(Q$16&$M$17&$M26,Data!$D:$X,MATCH(Login_Report!Q$15,Data!$D$4:$X$4,0),FALSE)=0,\"\",VLOOKUP(Q$16&$M$17&$M26,Data!$D:$X,MATCH(Login_Report!Q$15,Data!$D$4:$X$4,0),FALSE)),\"\")","v":""},{"$f":"IFERROR(IF(VLOOKUP(R$16&$M$17&$M26,Data!$D:$X,MATCH(Login_Report!R$15,Data!$D$4:$X$4,0),FALSE)=0,\"\",VLOOKUP(R$16&$M$17&$M26,Data!$D:$X,MATCH(Login_Report!R$15,Data!$D$4:$X$4,0),FALSE)),\"\")","v":""},{"$f":"IFERROR(IF(VLOOKUP(S$16&$M$17&$M26,Data!$D:$X,MATCH(Login_Report!S$15,Data!$D$4:$X$4,0),FALSE)=0,\"\",VLOOKUP(S$16&$M$17&$M26,Data!$D:$X,MATCH(Login_Report!S$15,Data!$D$4:$X$4,0),FALSE)),\"\")","v":""},{"$f":"IFERROR(IF(VLOOKUP(T$16&$M$17&$M26,Data!$D:$X,MATCH(Login_Report!T$15,Data!$D$4:$X$4,0),FALSE)=0,\"\",VLOOKUP(T$16&$M$17&$M26,Data!$D:$X,MATCH(Login_Report!T$15,Data!$D$4:$X$4,0),FALSE)),\"\")","v":""},{"$f":"IFERROR(IF(VLOOKUP(U$16&$M$17&$M26,Data!$D:$X,MATCH(Login_Report!U$15,Data!$D$4:$X$4,0),FALSE)=0,\"\",VLOOKUP(U$16&$M$17&$M26,Data!$D:$X,MATCH(Login_Report!U$15,Data!$D$4:$X$4,0),FALSE)),\"\")","v":""},null,"",null,0,null,0,null,0,null,0,null,0,null,0,null,0,null,0,null,null,null,null,{"$f":"IF(Staff!D19=\"\",\"\",Staff!D19)","v":""},{"$f":"IFERROR(IF(VLOOKUP(AS$16&$AR26&$AR$17,Data!$D:$X,MATCH(Login_Report!AS$15,Data!$D$4:$X$4,0),FALSE)=0,\"\",VLOOKUP(AS$16&$AR26&$AR$17,Data!$D:$X,MATCH(Login_Report!AS$15,Data!$D$4:$X$4,0),FALSE)),\"\")","v":""},{"$f":"IFERROR(IF(VLOOKUP(AT$16&$AR26&$AR$17,Data!$D:$X,MATCH(Login_Report!AT$15,Data!$D$4:$X$4,0),FALSE)=0,\"\",VLOOKUP(AT$16&$AR26&$AR$17,Data!$D:$X,MATCH(Login_Report!AT$15,Data!$D$4:$X$4,0),FALSE)),\"\")","v":""},{"$f":"IFERROR(IF(VLOOKUP(AU$16&$AR26&$AR$17,Data!$D:$X,MATCH(Login_Report!AU$15,Data!$D$4:$X$4,0),FALSE)=0,\"\",VLOOKUP(AU$16&$AR26&$AR$17,Data!$D:$X,MATCH(Login_Report!AU$15,Data!$D$4:$X$4,0),FALSE)),\"\")","v":""},{"$f":"IFERROR(IF(VLOOKUP(AV$16&$AR26&$AR$17,Data!$D:$X,MATCH(Login_Report!AV$15,Data!$D$4:$X$4,0),FALSE)=0,\"\",VLOOKUP(AV$16&$AR26&$AR$17,Data!$D:$X,MATCH(Login_Report!AV$15,Data!$D$4:$X$4,0),FALSE)),\"\")","v":""},{"$f":"IFERROR(IF(VLOOKUP(AW$16&$AR26&$AR$17,Data!$D:$X,MATCH(Login_Report!AW$15,Data!$D$4:$X$4,0),FALSE)=0,\"\",VLOOKUP(AW$16&$AR26&$AR$17,Data!$D:$X,MATCH(Login_Report!AW$15,Data!$D$4:$X$4,0),FALSE)),\"\")","v":""},{"$f":"IFERROR(IF(VLOOKUP(AX$16&$AR26&$AR$17,Data!$D:$X,MATCH(Login_Report!AX$15,Data!$D$4:$X$4,0),FALSE)=0,\"\",VLOOKUP(AX$16&$AR26&$AR$17,Data!$D:$X,MATCH(Login_Report!AX$15,Data!$D$4:$X$4,0),FALSE)),\"\")","v":""},{"$f":"IFERROR(IF(VLOOKUP(AY$16&$AR26&$AR$17,Data!$D:$X,MATCH(Login_Report!AY$15,Data!$D$4:$X$4,0),FALSE)=0,\"\",VLOOKUP(AY$16&$AR26&$AR$17,Data!$D:$X,MATCH(Login_Report!AY$15,Data!$D$4:$X$4,0),FALSE)),\"\")","v":""},{"$f":"IFERROR(IF(VLOOKUP(AZ$16&$AR26&$AR$17,Data!$D:$X,MATCH(Login_Report!AZ$15,Data!$D$4:$X$4,0),FALSE)=0,\"\",VLOOKUP(AZ$16&$AR26&$AR$17,Data!$D:$X,MATCH(Login_Report!AZ$15,Data!$D$4:$X$4,0),FALSE)),\"\")","v":""},null,"",null,0,null,0,null,0,null,0]
[null,0,null,0,null,0,null,0,"2017-09-23",8,null,null,"2017-09-23",{"$f":"IFERROR(IF(VLOOKUP(N$16&$M$17&$M27,Data!$D:$X,MATCH(Login_Report!N$15,Data!$D$4:$X$4,0),FALSE)=0,\"\",VLOOKUP(N$16&$M$17&$M27,Data!$D:$X,MATCH(Login_Report!N$15,Data!$D$4:$X$4,0),FALSE)),\"\")","v":""},{"$f":"IFERROR(IF(VLOOKUP(O$16&$M$17&$M27,Data!$D:$X,MATCH(Login_Report!O$15,Data!$D$4:$X$4,0),FALSE)=0,\"\",VLOOKUP(O$16&$M$17&$M27,Data!$D:$X,MATCH(Login_Report!O$15,Data!$D$4:$X$4,0),FALSE)),\"\")","v":""},{"$f":"IFERROR(IF(VLOOKUP(P$16&$M$17&$M27,Data!$D:$X,MATCH(Login_Report!P$15,Data!$D$4:$X$4,0),FALSE)=0,\"\",VLOOKUP(P$16&$M$17&$M27,Data!$D:$X,MATCH(Login_Report!P$15,Data!$D$4:$X$4,0),FALSE)),\"\")","v":""},{"$f":"IFERROR(IF(VLOOKUP(Q$16&$M$17&$M27,Data!$D:$X,MATCH(Login_Report!Q$15,Data!$D$4:$X$4,0),FALSE)=0,\"\",VLOOKUP(Q$16&$M$17&$M27,Data!$D:$X,MATCH(Login_Report!Q$15,Data!$D$4:$X$4,0),FALSE)),\"\")","v":""},{"$f":"IFERROR(IF(VLOOKUP(R$16&$M$17&$M27,Data!$D:$X,MATCH(Login_Report!R$15,Data!$D$4:$X$4,0),FALSE)=0,\"\",VLOOKUP(R$16&$M$17&$M27,Data!$D:$X,MATCH(Login_Report!R$15,Data!$D$4:$X$4,0),FALSE)),\"\")","v":""},{"$f":"IFERROR(IF(VLOOKUP(S$16&$M$17&$M27,Data!$D:$X,MATCH(Login_Report!S$15,Data!$D$4:$X$4,0),FALSE)=0,\"\",VLOOKUP(S$16&$M$17&$M27,Data!$D:$X,MATCH(Login_Report!S$15,Data!$D$4:$X$4,0),FALSE)),\"\")","v":""},{"$f":"IFERROR(IF(VLOOKUP(T$16&$M$17&$M27,Data!$D:$X,MATCH(Login_Report!T$15,Data!$D$4:$X$4,0),FALSE)=0,\"\",VLOOKUP(T$16&$M$17&$M27,Data!$D:$X,MATCH(Login_Report!T$15,Data!$D$4:$X$4,0),FALSE)),\"\")","v":""},{"$f":"IFERROR(IF(VLOOKUP(U$16&$M$17&$M27,Data!$D:$X,MATCH(Login_Report!U$15,Data!$D$4:$X$4,0),FALSE)=0,\"\",VLOOKUP(U$16&$M$17&$M27,Data!$D:$X,MATCH(Login_Report!U$15,Data!$D$4:$X$4,0),FALSE)),\"\")","v":""},null,"",null,0,null,0,null,0,null,0,null,0,null,0,null,0,null,0,null,null,null,null,{"$f":"IF(Staff!D20=\"\",\"\",Staff!D20)","v":""},{"$f":"IFERROR(IF(VLOOKUP(AS$16&$AR27&$AR$17,Data!$D:$X,MATCH(Login_Report!AS$15,Data!$D$4:$X$4,0),FALSE)=0,\"\",VLOOKUP(AS$16&$AR27&$AR$17,Data!$D:$X,MATCH(Login_Report!AS$15,Data!$D$4:$X$4,0),FALSE)),\"\")","v":""},{"$f":"IFERROR(IF(VLOOKUP(AT$16&$AR27&$AR$17,Data!$D:$X,MATCH(Login_Report!AT$15,Data!$D$4:$X$4,0),FALSE)=0,\"\",VLOOKUP(AT$16&$AR27&$AR$17,Data!$D:$X,MATCH(Login_Report!AT$15,Data!$D$4:$X$4,0),FALSE)),\"\")","v":""},{"$f":"IFERROR(IF(VLOOKUP(AU$16&$AR27&$AR$17,Data!$D:$X,MATCH(Login_Report!AU$15,Data!$D$4:$X$4,0),FALSE)=0,\"\",VLOOKUP(AU$16&$AR27&$AR$17,Data!$D:$X,MATCH(Login_Report!AU$15,Data!$D$4:$X$4,0),FALSE)),\"\")","v":""},{"$f":"IFERROR(IF(VLOOKUP(AV$16&$AR27&$AR$17,Data!$D:$X,MATCH(Login_Report!AV$15,Data!$D$4:$X$4,0),FALSE)=0,\"\",VLOOKUP(AV$16&$AR27&$AR$17,Data!$D:$X,MATCH(Login_Report!AV$15,Data!$D$4:$X$4,0),FALSE)),\"\")","v":""},{"$f":"IFERROR(IF(VLOOKUP(AW$16&$AR27&$AR$17,Data!$D:$X,MATCH(Login_Report!AW$15,Data!$D$4:$X$4,0),FALSE)=0,\"\",VLOOKUP(AW$16&$AR27&$AR$17,Data!$D:$X,MATCH(Login_Report!AW$15,Data!$D$4:$X$4,0),FALSE)),\"\")","v":""},{"$f":"IFERROR(IF(VLOOKUP(AX$16&$AR27&$AR$17,Data!$D:$X,MATCH(Login_Report!AX$15,Data!$D$4:$X$4,0),FALSE)=0,\"\",VLOOKUP(AX$16&$AR27&$AR$17,Data!$D:$X,MATCH(Login_Report!AX$15,Data!$D$4:$X$4,0),FALSE)),\"\")","v":""},{"$f":"IFERROR(IF(VLOOKUP(AY$16&$AR27&$AR$17,Data!$D:$X,MATCH(Login_Report!AY$15,Data!$D$4:$X$4,0),FALSE)=0,\"\",VLOOKUP(AY$16&$AR27&$AR$17,Data!$D:$X,MATCH(Login_Report!AY$15,Data!$D$4:$X$4,0),FALSE)),\"\")","v":""},{"$f":"IFERROR(IF(VLOOKUP(AZ$16&$AR27&$AR$17,Data!$D:$X,MATCH(Login_Report!AZ$15,Data!$D$4:$X$4,0),FALSE)=0,\"\",VLOOKUP(AZ$16&$AR27&$AR$17,Data!$D:$X,MATCH(Login_Report!AZ$15,Data!$D$4:$X$4,0),FALSE)),\"\")","v":""},null,"",null,0,null,0,null,0,null,0]
[null,0,null,0,null,0,null,0,"2017-09-24",9,null,null,"2017-09-24",{"$f":"IFERROR(IF(VLOOKUP(N$16&$M$17&$M28,Data!$D:$X,MATCH(Login_Report!N$15,Data!$D$4:$X$4,0),FALSE)=0,\"\",VLOOKUP(N$16&$M$17&$M28,Data!$D:$X,MATCH(Login_Report!N$15,Data!$D$4:$X$4,0),FALSE)),\"\")","v":""},{"$f":"IFERROR(IF(VLOOKUP(O$16&$M$17&$M28,Data!$D:$X,MATCH(Login_Report!O$15,Data!$D$4:$X$4,0),FALSE)=0,\"\",VLOOKUP(O$16&$M$17&$M28,Data!$D:$X,MATCH(Login_Report!O$15,Data!$D$4:$X$4,0),FALSE)),\"\")","v":""},{"$f":"IFERROR(IF(VLOOKUP(P$16&$M$17&$M28,Data!$D:$X,MATCH(Login_Report!P$15,Data!$D$4:$X$4,0),FALSE)=0,\"\",VLOOKUP(P$16&$M$17&$M28,Data!$D:$X,MATCH(Login_Report!P$15,Data!$D$4:$X$4,0),FALSE)),\"\")","v":""},{"$f":"IFERROR(IF(VLOOKUP(Q$16&$M$17&$M28,Data!$D:$X,MATCH(Login_Report!Q$15,Data!$D$4:$X$4,0),FALSE)=0,\"\",VLOOKUP(Q$16&$M$17&$M28,Data!$D:$X,MATCH(Login_Report!Q$15,Data!$D$4:$X$4,0),FALSE)),\"\")","v":""},{"$f":"IFERROR(IF(VLOOKUP(R$16&$M$17&$M28,Data!$D:$X,MATCH(Login_Report!R$15,Data!$D$4:$X$4,0),FALSE)=0,\"\",VLOOKUP(R$16&$M$17&$M28,Data!$D:$X,MATCH(Login_Report!R$15,Data!$D$4:$X$4,0),FALSE)),\"\")","v":""},{"$f":"IFERROR(IF(VLOOKUP(S$16&$M$17&$M28,Data!$D:$X,MATCH(Login_Report!S$15,Data!$D$4:$X$4,0),FALSE)=0,\"\",VLOOKUP(S$16&$M$17&$M28,Data!$D:$X,MATCH(Login_Report!S$15,Data!$D$4:$X$4,0),FALSE)),\"\")","v":""},{"$f":"IFERROR(IF(VLOOKUP(T$16&$M$17&$M28,Data!$D:$X,MATCH(Login_Report!T$15,Data!$D$4:$X$4,0),FALSE)=0,\"\",VLOOKUP(T$16&$M$17&$M28,Data!$D:$X,MATCH(Login_Report!T$15,Data!$D$4:$X$4,0),FALSE)),\"\")","v":""},{"$f":"IFERROR(IF(VLOOKUP(U$16&$M$17&$M28,Data!$D:$X,MATCH(Login_Report!U$15,Data!$D$4:$X$4,0),FALSE)=0,\"\",VLOOKUP(U$16&$M$17&$M28,Data!$D:$X,MATCH(Login_Report!U$15,Data!$D$4:$X$4,0),FALSE)),\"\")","v":""},null,"",null,0,null,0,null,0,null,0,null,0,null,0,null,0,null,0,null,null,null,null,{"$f":"IF(Staff!D21=\"\",\"\",Staff!D21)","v":""},{"$f":"IFERROR(IF(VLOOKUP(AS$16&$AR28&$AR$17,Data!$D:$X,MATCH(Login_Report!AS$15,Data!$D$4:$X$4,0),FALSE)=0,\"\",VLOOKUP(AS$16&$AR28&$AR$17,Data!$D:$X,MATCH(Login_Report!AS$15,Data!$D$4:$X$4,0),FALSE)),\"\")","v":""},{"$f":"IFERROR(IF(VLOOKUP(AT$16&$AR28&$AR$17,Data!$D:$X,MATCH(Login_Report!AT$15,Data!$D$4:$X$4,0),FALSE)=0,\"\",VLOOKUP(AT$16&$AR28&$AR$17,Data!$D:$X,MATCH(Login_Report!AT$15,Data!$D$4:$X$4,0),FALSE)),\"\")","v":""},{"$f":"IFERROR(IF(VLOOKUP(AU$16&$AR28&$AR$17,Data!$D:$X,MATCH(Login_Report!AU$15,Data!$D$4:$X$4,0),FALSE)=0,\"\",VLOOKUP(AU$16&$AR28&$AR$17,Data!$D:$X,MATCH(Login_Report!AU$15,Data!$D$4:$X$4,0),FALSE)),\"\")","v":""},{"$f":"IFERROR(IF(VLOOKUP(AV$16&$AR28&$AR$17,Data!$D:$X,MATCH(Login_Report!AV$15,Data!$D$4:$X$4,0),FALSE)=0,\"\",VLOOKUP(AV$16&$AR28&$AR$17,Data!$D:$X,MATCH(Login_Report!AV$15,Data!$D$4:$X$4,0),FALSE)),\"\")","v":""},{"$f":"IFERROR(IF(VLOOKUP(AW$16&$AR28&$AR$17,Data!$D:$X,MATCH(Login_Report!AW$15,Data!$D$4:$X$4,0),FALSE)=0,\"\",VLOOKUP(AW$16&$AR28&$AR$17,Data!$D:$X,MATCH(Login_Report!AW$15,Data!$D$4:$X$4,0),FALSE)),\"\")","v":""},{"$f":"IFERROR(IF(VLOOKUP(AX$16&$AR28&$AR$17,Data!$D:$X,MATCH(Login_Report!AX$15,Data!$D$4:$X$4,0),FALSE)=0,\"\",VLOOKUP(AX$16&$AR28&$AR$17,Data!$D:$X,MATCH(Login_Report!AX$15,Data!$D$4:$X$4,0),FALSE)),\"\")","v":""},{"$f":"IFERROR(IF(VLOOKUP(AY$16&$AR28&$AR$17,Data!$D:$X,MATCH(Login_Report!AY$15,Data!$D$4:$X$4,0),FALSE)=0,\"\",VLOOKUP(AY$16&$AR28&$AR$17,Data!$D:$X,MATCH(Login_Report!AY$15,Data!$D$4:$X$4,0),FALSE)),\"\")","v":""},{"$f":"IFERROR(IF(VLOOKUP(AZ$16&$AR28&$AR$17,Data!$D:$X,MATCH(Login_Report!AZ$15,Data!$D$4:$X$4,0),FALSE)=0,\"\",VLOOKUP(AZ$16&$AR28&$AR$17,Data!$D:$X,MATCH(Login_Report!AZ$15,Data!$D$4:$X$4,0),FALSE)),\"\")","v":""},null,"",null,0,null,0,null,0,null,0]
[null,0,null,0,null,0,null,0,"2017-09-25",10,null,null,"2017-09-25",{"$f":"IFERROR(IF(VLOOKUP(N$16&$M$17&$M29,Data!$D:$X,MATCH(Login_Report!N$15,Data!$D$4:$X$4,0),FALSE)=0,\"\",VLOOKUP(N$16&$M$17&$M29,Data!$D:$X,MATCH(Login_Report!N$15,Data!$D$4:$X$4,0),FALSE)),\"\")","v":""},{"$f":"IFERROR(IF(VLOOKUP(O$16&$M$17&$M29,Data!$D:$X,MATCH(Login_Report!O$15,Data!$D$4:$X$4,0),FALSE)=0,\"\",VLOOKUP(O$16&$M$17&$M29,Data!$D:$X,MATCH(Login_Report!O$15,Data!$D$4:$X$4,0),FALSE)),\"\")","v":""},{"$f":"IFERROR(IF(VLOOKUP(P$16&$M$17&$M29,Data!$D:$X,MATCH(Login_Report!P$15,Data!$D$4:$X$4,0),FALSE)=0,\"\",VLOOKUP(P$16&$M$17&$M29,Data!$D:$X,MATCH(Login_Report!P$15,Data!$D$4:$X$4,0),FALSE)),\"\")","v":""},{"$f":"IFERROR(IF(VLOOKUP(Q$16&$M$17&$M29,Data!$D:$X,MATCH(Login_Report!Q$15,Data!$D$4:$X$4,0),FALSE)=0,\"\",VLOOKUP(Q$16&$M$17&$M29,Data!$D:$X,MATCH(Login_Report!Q$15,Data!$D$4:$X$4,0),FALSE)),\"\")","v":""},{"$f":"IFERROR(IF(VLOOKUP(R$16&$M$17&$M29,Data!$D:$X,MATCH(Login_Report!R$15,Data!$D$4:$X$4,0),FALSE)=0,\"\",VLOOKUP(R$16&$M$17&$M29,Data!$D:$X,MATCH(Login_Report!R$15,Data!$D$4:$X$4,0),FALSE)),\"\")","v":""},{"$f":"IFERROR(IF(VLOOKUP(S$16&$M$17&$M29,Data!$D:$X,MATCH(Login_Report!S$15,Data!$D$4:$X$4,0),FALSE)=0,\"\",VLOOKUP(S$16&$M$17&$M29,Data!$D:$X,MATCH(Login_Report!S$15,Data!$D$4:$X$4,0),FALSE)),\"\")","v":""},{"$f":"IFERROR(IF(VLOOKUP(T$16&$M$17&$M29,Data!$D:$X,MATCH(Login_Report!T$15,Data!$D$4:$X$4,0),FALSE)=0,\"\",VLOOKUP(T$16&$M$17&$M29,Data!$D:$X,MATCH(Login_Report!T$15,Data!$D$4:$X$4,0),FALSE)),\"\")","v":""},{"$f":"IFERROR(IF(VLOOKUP(U$16&$M$17&$M29,Data!$D:$X,MATCH(Login_Report!U$15,Data!$D$4:$X$4,0),FALSE)=0,\"\",VLOOKUP(U$16&$M$17&$M29,Data!$D:$X,MATCH(Login_Report!U$15,Data!$D$4:$X$4,0),FALSE)),\"\")","v":""},null,"",null,0,null,0,null,0,null,0,null,0,null,0,null,0,null,0,null,null,null,null,{"$f":"IF(Staff!D22=\"\",\"\",Staff!D22)","v":""},{"$f":"IFERROR(IF(VLOOKUP(AS$16&$AR29&$AR$17,Data!$D:$X,MATCH(Login_Report!AS$15,Data!$D$4:$X$4,0),FALSE)=0,\"\",VLOOKUP(AS$16&$AR29&$AR$17,Data!$D:$X,MATCH(Login_Report!AS$15,Data!$D$4:$X$4,0),FALSE)),\"\")","v":""},{"$f":"IFERROR(IF(VLOOKUP(AT$16&$AR29&$AR$17,Data!$D:$X,MATCH(Login_Report!AT$15,Data!$D$4:$X$4,0),FALSE)=0,\"\",VLOOKUP(AT$16&$AR29&$AR$17,Data!$D:$X,MATCH(Login_Report!AT$15,Data!$D$4:$X$4,0),FALSE)),\"\")","v":""},{"$f":"IFERROR(IF(VLOOKUP(AU$16&$AR29&$AR$17,Data!$D:$X,MATCH(Login_Report!AU$15,Data!$D$4:$X$4,0),FALSE)=0,\"\",VLOOKUP(AU$16&$AR29&$AR$17,Data!$D:$X,MATCH(Login_Report!AU$15,Data!$D$4:$X$4,0),FALSE)),\"\")","v":""},{"$f":"IFERROR(IF(VLOOKUP(AV$16&$AR29&$AR$17,Data!$D:$X,MATCH(Login_Report!AV$15,Data!$D$4:$X$4,0),FALSE)=0,\"\",VLOOKUP(AV$16&$AR29&$AR$17,Data!$D:$X,MATCH(Login_Report!AV$15,Data!$D$4:$X$4,0),FALSE)),\"\")","v":""},{"$f":"IFERROR(IF(VLOOKUP(AW$16&$AR29&$AR$17,Data!$D:$X,MATCH(Login_Report!AW$15,Data!$D$4:$X$4,0),FALSE)=0,\"\",VLOOKUP(AW$16&$AR29&$AR$17,Data!$D:$X,MATCH(Login_Report!AW$15,Data!$D$4:$X$4,0),FALSE)),\"\")","v":""},{"$f":"IFERROR(IF(VLOOKUP(AX$16&$AR29&$AR$17,Data!$D:$X,MATCH(Login_Report!AX$15,Data!$D$4:$X$4,0),FALSE)=0,\"\",VLOOKUP(AX$16&$AR29&$AR$17,Data!$D:$X,MATCH(Login_Report!AX$15,Data!$D$4:$X$4,0),FALSE)),\"\")","v":""},{"$f":"IFERROR(IF(VLOOKUP(AY$16&$AR29&$AR$17,Data!$D:$X,MATCH(Login_Report!AY$15,Data!$D$4:$X$4,0),FALSE)=0,\"\",VLOOKUP(AY$16&$AR29&$AR$17,Data!$D:$X,MATCH(Login_Report!AY$15,Data!$D$4:$X$4,0),FALSE)),\"\")","v":""},{"$f":"IFERROR(IF(VLOOKUP(AZ$16&$AR29&$AR$17,Data!$D:$X,MATCH(Login_Report!AZ$15,Data!$D$4:$X$4,0),FALSE)=0,\"\",VLOOKUP(AZ$16&$AR29&$AR$17,Data!$D:$X,MATCH(Login_Report!AZ$15,Data!$D$4:$X$4,0),FALSE)),\"\")","v":""},null,"",null,0,null,0,null,0,null,0]
[null,0,null,0,null,0,null,0,"2017-09-26",11,null,null,"2017-09-26",{"$f":"IFERROR(IF(VLOOKUP(N$16&$M$17&$M30,Data!$D:$X,MATCH(Login_Report!N$15,Data!$D$4:$X$4,0),FALSE)=0,\"\",VLOOKUP(N$16&$M$17&$M30,Data!$D:$X,MATCH(Login_Report!N$15,Data!$D$4:$X$4,0),FALSE)),\"\")","v":""},{"$f":"IFERROR(IF(VLOOKUP(O$16&$M$17&$M30,Data!$D:$X,MATCH(Login_Report!O$15,Data!$D$4:$X$4,0),FALSE)=0,\"\",VLOOKUP(O$16&$M$17&$M30,Data!$D:$X,MATCH(Login_Report!O$15,Data!$D$4:$X$4,0),FALSE)),\"\")","v":""},{"$f":"IFERROR(IF(VLOOKUP(P$16&$M$17&$M30,Data!$D:$X,MATCH(Login_Report!P$15,Data!$D$4:$X$4,0),FALSE)=0,\"\",VLOOKUP(P$16&$M$17&$M30,Data!$D:$X,MATCH(Login_Report!P$15,Data!$D$4:$X$4,0),FALSE)),\"\")","v":""},{"$f":"IFERROR(IF(VLOOKUP(Q$16&$M$17&$M30,Data!$D:$X,MATCH(Login_Report!Q$15,Data!$D$4:$X$4,0),FALSE)=0,\"\",VLOOKUP(Q$16&$M$17&$M30,Data!$D:$X,MATCH(Login_Report!Q$15,Data!$D$4:$X$4,0),FALSE)),\"\")","v":""},{"$f":"IFERROR(IF(VLOOKUP(R$16&$M$17&$M30,Data!$D:$X,MATCH(Login_Report!R$15,Data!$D$4:$X$4,0),FALSE)=0,\"\",VLOOKUP(R$16&$M$17&$M30,Data!$D:$X,MATCH(Login_Report!R$15,Data!$D$4:$X$4,0),FALSE)),\"\")","v":""},{"$f":"IFERROR(IF(VLOOKUP(S$16&$M$17&$M30,Data!$D:$X,MATCH(Login_Report!S$15,Data!$D$4:$X$4,0),FALSE)=0,\"\",VLOOKUP(S$16&$M$17&$M30,Data!$D:$X,MATCH(Login_Report!S$15,Data!$D$4:$X$4,0),FALSE)),\"\")","v":""},{"$f":"IFERROR(IF(VLOOKUP(T$16&$M$17&$M30,Data!$D:$X,MATCH(Login_Report!T$15,Data!$D$4:$X$4,0),FALSE)=0,\"\",VLOOKUP(T$16&$M$17&$M30,Data!$D:$X,MATCH(Login_Report!T$15,Data!$D$4:$X$4,0),FALSE)),\"\")","v":""},{"$f":"IFERROR(IF(VLOOKUP(U$16&$M$17&$M30,Data!$D:$X,MATCH(Login_Report!U$15,Data!$D$4:$X$4,0),FALSE)=0,\"\",VLOOKUP(U$16&$M$17&$M30,Data!$D:$X,MATCH(Login_Report!U$15,Data!$D$4:$X$4,0),FALSE)),\"\")","v":""},null,"",null,0,null,0,null,0,null,0,null,0,null,0,null,0,null,0,null,null,null,null,{"$f":"IF(Staff!D23=\"\",\"\",Staff!D23)","v":""},{"$f":"IFERROR(IF(VLOOKUP(AS$16&$AR30&$AR$17,Data!$D:$X,MATCH(Login_Report!AS$15,Data!$D$4:$X$4,0),FALSE)=0,\"\",VLOOKUP(AS$16&$AR30&$AR$17,Data!$D:$X,MATCH(Login_Report!AS$15,Data!$D$4:$X$4,0),FALSE)),\"\")","v":""},{"$f":"IFERROR(IF(VLOOKUP(AT$16&$AR30&$AR$17,Data!$D:$X,MATCH(Login_Report!AT$15,Data!$D$4:$X$4,0),FALSE)=0,\"\",VLOOKUP(AT$16&$AR30&$AR$17,Data!$D:$X,MATCH(Login_Report!AT$15,Data!$D$4:$X$4,0),FALSE)),\"\")","v":""},{"$f":"IFERROR(IF(VLOOKUP(AU$16&$AR30&$AR$17,Data!$D:$X,MATCH(Login_Report!AU$15,Data!$D$4:$X$4,0),FALSE)=0,\"\",VLOOKUP(AU$16&$AR30&$AR$17,Data!$D:$X,MATCH(Login_Report!AU$15,Data!$D$4:$X$4,0),FALSE)),\"\")","v":""},{"$f":"IFERROR(IF(VLOOKUP(AV$16&$AR30&$AR$17,Data!$D:$X,MATCH(Login_Report!AV$15,Data!$D$4:$X$4,0),FALSE)=0,\"\",VLOOKUP(AV$16&$AR30&$AR$17,Data!$D:$X,MATCH(Login_Report!AV$15,Data!$D$4:$X$4,0),FALSE)),\"\")","v":""},{"$f":"IFERROR(IF(VLOOKUP(AW$16&$AR30&$AR$17,Data!$D:$X,MATCH(Login_Report!AW$15,Data!$D$4:$X$4,0),FALSE)=0,\"\",VLOOKUP(AW$16&$AR30&$AR$17,Data!$D:$X,MATCH(Login_Report!AW$15,Data!$D$4:$X$4,0),FALSE)),\"\")","v":""},{"$f":"IFERROR(IF(VLOOKUP(AX$16&$AR30&$AR$17,Data!$D:$X,MATCH(Login_Report!AX$15,Data!$D$4:$X$4,0),FALSE)=0,\"\",VLOOKUP(AX$16&$AR30&$AR$17,Data!$D:$X,MATCH(Login_Report!AX$15,Data!$D$4:$X$4,0),FALSE)),\"\")","v":""},{"$f":"IFERROR(IF(VLOOKUP(AY$16&$AR30&$AR$17,Data!$D:$X,MATCH(Login_Report!AY$15,Data!$D$4:$X$4,0),FALSE)=0,\"\",VLOOKUP(AY$16&$AR30&$AR$17,Data!$D:$X,MATCH(Login_Report!AY$15,Data!$D$4:$X$4,0),FALSE)),\"\")","v":""},{"$f":"IFERROR(IF(VLOOKUP(AZ$16&$AR30&$AR$17,Data!$D:$X,MATCH(Login_Report!AZ$15,Data!$D$4:$X$4,0),FALSE)=0,\"\",VLOOKUP(AZ$16&$AR30&$AR$17,Data!$D:$X,MATCH(Login_Report!AZ$15,Data!$D$4:$X$4,0),FALSE)),\"\")","v":""},null,"",null,0,null,0,null,0,null,0]
[null,0,null,0,null,0,null,0,"2017-09-27",12,null,null,"2017-09-27",{"$f":"IFERROR(IF(VLOOKUP(N$16&$M$17&$M31,Data!$D:$X,MATCH(Login_Report!N$15,Data!$D$4:$X$4,0),FALSE)=0,\"\",VLOOKUP(N$16&$M$17&$M31,Data!$D:$X,MATCH(Login_Report!N$15,Data!$D$4:$X$4,0),FALSE)),\"\")","v":""},{"$f":"IFERROR(IF(VLOOKUP(O$16&$M$17&$M31,Data!$D:$X,MATCH(Login_Report!O$15,Data!$D$4:$X$4,0),FALSE)=0,\"\",VLOOKUP(O$16&$M$17&$M31,Data!$D:$X,MATCH(Login_Report!O$15,Data!$D$4:$X$4,0),FALSE)),\"\")","v":""},{"$f":"IFERROR(IF(VLOOKUP(P$16&$M$17&$M31,Data!$D:$X,MATCH(Login_Report!P$15,Data!$D$4:$X$4,0),FALSE)=0,\"\",VLOOKUP(P$16&$M$17&$M31,Data!$D:$X,MATCH(Login_Report!P$15,Data!$D$4:$X$4,0),FALSE)),\"\")","v":""},{"$f":"IFERROR(IF(VLOOKUP(Q$16&$M$17&$M31,Data!$D:$X,MATCH(Login_Report!Q$15,Data!$D$4:$X$4,0),FALSE)=0,\"\",VLOOKUP(Q$16&$M$17&$M31,Data!$D:$X,MATCH(Login_Report!Q$15,Data!$D$4:$X$4,0),FALSE)),\"\")","v":""},{"$f":"IFERROR(IF(VLOOKUP(R$16&$M$17&$M31,Data!$D:$X,MATCH(Login_Report!R$15,Data!$D$4:$X$4,0),FALSE)=0,\"\",VLOOKUP(R$16&$M$17&$M31,Data!$D:$X,MATCH(Login_Report!R$15,Data!$D$4:$X$4,0),FALSE)),\"\")","v":""},{"$f":"IFERROR(IF(VLOOKUP(S$16&$M$17&$M31,Data!$D:$X,MATCH(Login_Report!S$15,Data!$D$4:$X$4,0),FALSE)=0,\"\",VLOOKUP(S$16&$M$17&$M31,Data!$D:$X,MATCH(Login_Report!S$15,Data!$D$4:$X$4,0),FALSE)),\"\")","v":""},{"$f":"IFERROR(IF(VLOOKUP(T$16&$M$17&$M31,Data!$D:$X,MATCH(Login_Report!T$15,Data!$D$4:$X$4,0),FALSE)=0,\"\",VLOOKUP(T$16&$M$17&$M31,Data!$D:$X,MATCH(Login_Report!T$15,Data!$D$4:$X$4,0),FALSE)),\"\")","v":""},{"$f":"IFERROR(IF(VLOOKUP(U$16&$M$17&$M31,Data!$D:$X,MATCH(Login_Report!U$15,Data!$D$4:$X$4,0),FALSE)=0,\"\",VLOOKUP(U$16&$M$17&$M31,Data!$D:$X,MATCH(Login_Report!U$15,Data!$D$4:$X$4,0),FALSE)),\"\")","v":""},null,"",null,0,null,0,null,0,null,0,null,0,null,0,null,0,null,0,null,null,null,null,{"$f":"IF(Staff!D24=\"\",\"\",Staff!D24)","v":""},{"$f":"IFERROR(IF(VLOOKUP(AS$16&$AR31&$AR$17,Data!$D:$X,MATCH(Login_Report!AS$15,Data!$D$4:$X$4,0),FALSE)=0,\"\",VLOOKUP(AS$16&$AR31&$AR$17,Data!$D:$X,MATCH(Login_Report!AS$15,Data!$D$4:$X$4,0),FALSE)),\"\")","v":""},{"$f":"IFERROR(IF(VLOOKUP(AT$16&$AR31&$AR$17,Data!$D:$X,MATCH(Login_Report!AT$15,Data!$D$4:$X$4,0),FALSE)=0,\"\",VLOOKUP(AT$16&$AR31&$AR$17,Data!$D:$X,MATCH(Login_Report!AT$15,Data!$D$4:$X$4,0),FALSE)),\"\")","v":""},{"$f":"IFERROR(IF(VLOOKUP(AU$16&$AR31&$AR$17,Data!$D:$X,MATCH(Login_Report!AU$15,Data!$D$4:$X$4,0),FALSE)=0,\"\",VLOOKUP(AU$16&$AR31&$AR$17,Data!$D:$X,MATCH(Login_Report!AU$15,Data!$D$4:$X$4,0),FALSE)),\"\")","v":""},{"$f":"IFERROR(IF(VLOOKUP(AV$16&$AR31&$AR$17,Data!$D:$X,MATCH(Login_Report!AV$15,Data!$D$4:$X$4,0),FALSE)=0,\"\",VLOOKUP(AV$16&$AR31&$AR$17,Data!$D:$X,MATCH(Login_Report!AV$15,Data!$D$4:$X$4,0),FALSE)),\"\")","v":""},{"$f":"IFERROR(IF(VLOOKUP(AW$16&$AR31&$AR$17,Data!$D:$X,MATCH(Login_Report!AW$15,Data!$D$4:$X$4,0),FALSE)=0,\"\",VLOOKUP(AW$16&$AR31&$AR$17,Data!$D:$X,MATCH(Login_Report!AW$15,Data!$D$4:$X$4,0),FALSE)),\"\")","v":""},{"$f":"IFERROR(IF(VLOOKUP(AX$16&$AR31&$AR$17,Data!$D:$X,MATCH(Login_Report!AX$15,Data!$D$4:$X$4,0),FALSE)=0,\"\",VLOOKUP(AX$16&$AR31&$AR$17,Data!$D:$X,MATCH(Login_Report!AX$15,Data!$D$4:$X$4,0),FALSE)),\"\")","v":""},{"$f":"IFERROR(IF(VLOOKUP(AY$16&$AR31&$AR$17,Data!$D:$X,MATCH(Login_Report!AY$15,Data!$D$4:$X$4,0),FALSE)=0,\"\",VLOOKUP(AY$16&$AR31&$AR$17,Data!$D:$X,MATCH(Login_Report!AY$15,Data!$D$4:$X$4,0),FALSE)),\"\")","v":""},{"$f":"IFERROR(IF(VLOOKUP(AZ$16&$AR31&$AR$17,Data!$D:$X,MATCH(Login_Report!AZ$15,Data!$D$4:$X$4,0),FALSE)=0,\"\",VLOOKUP(AZ$16&$AR31&$AR$17,Data!$D:$X,MATCH(Login_Report!AZ$15,Data!$D$4:$X$4,0),FALSE)),\"\")","v":""},null,"",null,0,null,0,null,0,null,0]
[null,0,null,0,null,0,null,0,"2017-09-28",13,null,null,"2017-09-28",{"$f":"IFERROR(IF(VLOOKUP(N$16&$M$17&$M32,Data!$D:$X,MATCH(Login_Report!N$15,Data!$D$4:$X$4,0),FALSE)=0,\"\",VLOOKUP(N$16&$M$17&$M32,Data!$D:$X,MATCH(Login_Report!N$15,Data!$D$4:$X$4,0),FALSE)),\"\")","v":""},{"$f":"IFERROR(IF(VLOOKUP(O$16&$M$17&$M32,Data!$D:$X,MATCH(Login_Report!O$15,Data!$D$4:$X$4,0),FALSE)=0,\"\",VLOOKUP(O$16&$M$17&$M32,Data!$D:$X,MATCH(Login_Report!O$15,Data!$D$4:$X$4,0),FALSE)),\"\")","v":""},{"$f":"IFERROR(IF(VLOOKUP(P$16&$M$17&$M32,Data!$D:$X,MATCH(Login_Report!P$15,Data!$D$4:$X$4,0),FALSE)=0,\"\",VLOOKUP(P$16&$M$17&$M32,Data!$D:$X,MATCH(Login_Report!P$15,Data!$D$4:$X$4,0),FALSE)),\"\")","v":""},{"$f":"IFERROR(IF(VLOOKUP(Q$16&$M$17&$M32,Data!$D:$X,MATCH(Login_Report!Q$15,Data!$D$4:$X$4,0),FALSE)=0,\"\",VLOOKUP(Q$16&$M$17&$M32,Data!$D:$X,MATCH(Login_Report!Q$15,Data!$D$4:$X$4,0),FALSE)),\"\")","v":""},{"$f":"IFERROR(IF(VLOOKUP(R$16&$M$17&$M32,Data!$D:$X,MATCH(Login_Report!R$15,Data!$D$4:$X$4,0),FALSE)=0,\"\",VLOOKUP(R$16&$M$17&$M32,Data!$D:$X,MATCH(Login_Report!R$15,Data!$D$4:$X$4,0),FALSE)),\"\")","v":""},{"$f":"IFERROR(IF(VLOOKUP(S$16&$M$17&$M32,Data!$D:$X,MATCH(Login_Report!S$15,Data!$D$4:$X$4,0),FALSE)=0,\"\",VLOOKUP(S$16&$M$17&$M32,Data!$D:$X,MATCH(Login_Report!S$15,Data!$D$4:$X$4,0),FALSE)),\"\")","v":""},{"$f":"IFERROR(IF(VLOOKUP(T$16&$M$17&$M32,Data!$D:$X,MATCH(Login_Report!T$15,Data!$D$4:$X$4,0),FALSE)=0,\"\",VLOOKUP(T$16&$M$17&$M32,Data!$D:$X,MATCH(Login_Report!T$15,Data!$D$4:$X$4,0),FALSE)),\"\")","v":""},{"$f":"IFERROR(IF(VLOOKUP(U$16&$M$17&$M32,Data!$D:$X,MATCH(Login_Report!U$15,Data!$D$4:$X$4,0),FALSE)=0,\"\",VLOOKUP(U$16&$M$17&$M32,Data!$D:$X,MATCH(Login_Report!U$15,Data!$D$4:$X$4,0),FALSE)),\"\")","v":""},null,"",null,0,null,0,null,0,null,0,null,0,null,0,null,0,null,0,null,null,null,null,{"$f":"IF(Staff!D25=\"\",\"\",Staff!D25)","v":""},{"$f":"IFERROR(IF(VLOOKUP(AS$16&$AR32&$AR$17,Data!$D:$X,MATCH(Login_Report!AS$15,Data!$D$4:$X$4,0),FALSE)=0,\"\",VLOOKUP(AS$16&$AR32&$AR$17,Data!$D:$X,MATCH(Login_Report!AS$15,Data!$D$4:$X$4,0),FALSE)),\"\")","v":""},{"$f":"IFERROR(IF(VLOOKUP(AT$16&$AR32&$AR$17,Data!$D:$X,MATCH(Login_Report!AT$15,Data!$D$4:$X$4,0),FALSE)=0,\"\",VLOOKUP(AT$16&$AR32&$AR$17,Data!$D:$X,MATCH(Login_Report!AT$15,Data!$D$4:$X$4,0),FALSE)),\"\")","v":""},{"$f":"IFERROR(IF(VLOOKUP(AU$16&$AR32&$AR$17,Data!$D:$X,MATCH(Login_Report!AU$15,Data!$D$4:$X$4,0),FALSE)=0,\"\",VLOOKUP(AU$16&$AR32&$AR$17,Data!$D:$X,MATCH(Login_Report!AU$15,Data!$D$4:$X$4,0),FALSE)),\"\")","v":""},{"$f":"IFERROR(IF(VLOOKUP(AV$16&$AR32&$AR$17,Data!$D:$X,MATCH(Login_Report!AV$15,Data!$D$4:$X$4,0),FALSE)=0,\"\",VLOOKUP(AV$16&$AR32&$AR$17,Data!$D:$X,MATCH(Login_Report!AV$15,Data!$D$4:$X$4,0),FALSE)),\"\")","v":""},{"$f":"IFERROR(IF(VLOOKUP(AW$16&$AR32&$AR$17,Data!$D:$X,MATCH(Login_Report!AW$15,Data!$D$4:$X$4,0),FALSE)=0,\"\",VLOOKUP(AW$16&$AR32&$AR$17,Data!$D:$X,MATCH(Login_Report!AW$15,Data!$D$4:$X$4,0),FALSE)),\"\")","v":""},{"$f":"IFERROR(IF(VLOOKUP(AX$16&$AR32&$AR$17,Data!$D:$X,MATCH(Login_Report!AX$15,Data!$D$4:$X$4,0),FALSE)=0,\"\",VLOOKUP(AX$16&$AR32&$AR$17,Data!$D:$X,MATCH(Login_Report!AX$15,Data!$D$4:$X$4,0),FALSE)),\"\")","v":""},{"$f":"IFERROR(IF(VLOOKUP(AY$16&$AR32&$AR$17,Data!$D:$X,MATCH(Login_Report!AY$15,Data!$D$4:$X$4,0),FALSE)=0,\"\",VLOOKUP(AY$16&$AR32&$AR$17,Data!$D:$X,MATCH(Login_Report!AY$15,Data!$D$4:$X$4,0),FALSE)),\"\")","v":""},{"$f":"IFERROR(IF(VLOOKUP(AZ$16&$AR32&$AR$17,Data!$D:$X,MATCH(Login_Report!AZ$15,Data!$D$4:$X$4,0),FALSE)=0,\"\",VLOOKUP(AZ$16&$AR32&$AR$17,Data!$D:$X,MATCH(Login_Report!AZ$15,Data!$D$4:$X$4,0),FALSE)),\"\")","v":""},null,"",null,0,null,0,null,0,null,0]
[null,0,null,0,null,0,null,0,"2017-09-29",14,null,null,"2017-09-29",{"$f":"IFERROR(IF(VLOOKUP(N$16&$M$17&$M33,Data!$D:$X,MATCH(Login_Report!N$15,Data!$D$4:$X$4,0),FALSE)=0,\"\",VLOOKUP(N$16&$M$17&$M33,Data!$D:$X,MATCH(Login_Report!N$15,Data!$D$4:$X$4,0),FALSE)),\"\")","v":""},{"$f":"IFERROR(IF(VLOOKUP(O$16&$M$17&$M33,Data!$D:$X,MATCH(Login_Report!O$15,Data!$D$4:$X$4,0),FALSE)=0,\"\",VLOOKUP(O$16&$M$17&$M33,Data!$D:$X,MATCH(Login_Report!O$15,Data!$D$4:$X$4,0),FALSE)),\"\")","v":""},{"$f":"IFERROR(IF(VLOOKUP(P$16&$M$17&$M33,Data!$D:$X,MATCH(Login_Report!P$15,Data!$D$4:$X$4,0),FALSE)=0,\"\",VLOOKUP(P$16&$M$17&$M33,Data!$D:$X,MATCH(Login_Report!P$15,Data!$D$4:$X$4,0),FALSE)),\"\")","v":""},{"$f":"IFERROR(IF(VLOOKUP(Q$16&$M$17&$M33,Data!$D:$X,MATCH(Login_Report!Q$15,Data!$D$4:$X$4,0),FALSE)=0,\"\",VLOOKUP(Q$16&$M$17&$M33,Data!$D:$X,MATCH(Login_Report!Q$15,Data!$D$4:$X$4,0),FALSE)),\"\")","v":""},{"$f":"IFERROR(IF(VLOOKUP(R$16&$M$17&$M33,Data!$D:$X,MATCH(Login_Report!R$15,Data!$D$4:$X$4,0),FALSE)=0,\"\",VLOOKUP(R$16&$M$17&$M33,Data!$D:$X,MATCH(Login_Report!R$15,Data!$D$4:$X$4,0),FALSE)),\"\")","v":""},{"$f":"IFERROR(IF(VLOOKUP(S$16&$M$17&$M33,Data!$D:$X,MATCH(Login_Report!S$15,Data!$D$4:$X$4,0),FALSE)=0,\"\",VLOOKUP(S$16&$M$17&$M33,Data!$D:$X,MATCH(Login_Report!S$15,Data!$D$4:$X$4,0),FALSE)),\"\")","v":""},{"$f":"IFERROR(IF(VLOOKUP(T$16&$M$17&$M33,Data!$D:$X,MATCH(Login_Report!T$15,Data!$D$4:$X$4,0),FALSE)=0,\"\",VLOOKUP(T$16&$M$17&$M33,Data!$D:$X,MATCH(Login_Report!T$15,Data!$D$4:$X$4,0),FALSE)),\"\")","v":""},{"$f":"IFERROR(IF(VLOOKUP(U$16&$M$17&$M33,Data!$D:$X,MATCH(Login_Report!U$15,Data!$D$4:$X$4,0),FALSE)=0,\"\",VLOOKUP(U$16&$M$17&$M33,Data!$D:$X,MATCH(Login_Report!U$15,Data!$D$4:$X$4,0),FALSE)),\"\")","v":""},null,"",null,0,null,0,null,0,null,0,null,0,null,0,null,0,null,0,null,null,null,null,{"$f":"IF(Staff!D26=\"\",\"\",Staff!D26)","v":""},{"$f":"IFERROR(IF(VLOOKUP(AS$16&$AR33&$AR$17,Data!$D:$X,MATCH(Login_Report!AS$15,Data!$D$4:$X$4,0),FALSE)=0,\"\",VLOOKUP(AS$16&$AR33&$AR$17,Data!$D:$X,MATCH(Login_Report!AS$15,Data!$D$4:$X$4,0),FALSE)),\"\")","v":""},{"$f":"IFERROR(IF(VLOOKUP(AT$16&$AR33&$AR$17,Data!$D:$X,MATCH(Login_Report!AT$15,Data!$D$4:$X$4,0),FALSE)=0,\"\",VLOOKUP(AT$16&$AR33&$AR$17,Data!$D:$X,MATCH(Login_Report!AT$15,Data!$D$4:$X$4,0),FALSE)),\"\")","v":""},{"$f":"IFERROR(IF(VLOOKUP(AU$16&$AR33&$AR$17,Data!$D:$X,MATCH(Login_Report!AU$15,Data!$D$4:$X$4,0),FALSE)=0,\"\",VLOOKUP(AU$16&$AR33&$AR$17,Data!$D:$X,MATCH(Login_Report!AU$15,Data!$D$4:$X$4,0),FALSE)),\"\")","v":""},{"$f":"IFERROR(IF(VLOOKUP(AV$16&$AR33&$AR$17,Data!$D:$X,MATCH(Login_Report!AV$15,Data!$D$4:$X$4,0),FALSE)=0,\"\",VLOOKUP(AV$16&$AR33&$AR$17,Data!$D:$X,MATCH(Login_Report!AV$15,Data!$D$4:$X$4,0),FALSE)),\"\")","v":""},{"$f":"IFERROR(IF(VLOOKUP(AW$16&$AR33&$AR$17,Data!$D:$X,MATCH(Login_Report!AW$15,Data!$D$4:$X$4,0),FALSE)=0,\"\",VLOOKUP(AW$16&$AR33&$AR$17,Data!$D:$X,MATCH(Login_Report!AW$15,Data!$D$4:$X$4,0),FALSE)),\"\")","v":""},{"$f":"IFERROR(IF(VLOOKUP(AX$16&$AR33&$AR$17,Data!$D:$X,MATCH(Login_Report!AX$15,Data!$D$4:$X$4,0),FALSE)=0,\"\",VLOOKUP(AX$16&$AR33&$AR$17,Data!$D:$X,MATCH(Login_Report!AX$15,Data!$D$4:$X$4,0),FALSE)),\"\")","v":""},{"$f":"IFERROR(IF(VLOOKUP(AY$16&$AR33&$AR$17,Data!$D:$X,MATCH(Login_Report!AY$15,Data!$D$4:$X$4,0),FALSE)=0,\"\",VLOOKUP(AY$16&$AR33&$AR$17,Data!$D:$X,MATCH(Login_Report!AY$15,Data!$D$4:$X$4,0),FALSE)),\"\")","v":""},{"$f":"IFERROR(IF(VLOOKUP(AZ$16&$AR33&$AR$17,Data!$D:$X,MATCH(Login_Report!AZ$15,Data!$D$4:$X$4,0),FALSE)=0,\"\",VLOOKUP(AZ$16&$AR33&$AR$17,Data!$D:$X,MATCH(Login_Report!AZ$15,Data!$D$4:$X$4,0),FALSE)),\"\")","v":""},null,"",null,0,null,0,null,0,null,0]
[null,0,null,0,null,0,null,0,"2017-09-30",15,null,null,"2017-09-30",{"$f":"IFERROR(IF(VLOOKUP(N$16&$M$17&$M34,Data!$D:$X,MATCH(Login_Report!N$15,Data!$D$4:$X$4,0),FALSE)=0,\"\",VLOOKUP(N$16&$M$17&$M34,Data!$D:$X,MATCH(Login_Report!N$15,Data!$D$4:$X$4,0),FALSE)),\"\")","v":""},{"$f":"IFERROR(IF(VLOOKUP(O$16&$M$17&$M34,Data!$D:$X,MATCH(Login_Report!O$15,Data!$D$4:$X$4,0),FALSE)=0,\"\",VLOOKUP(O$16&$M$17&$M34,Data!$D:$X,MATCH(Login_Report!O$15,Data!$D$4:$X$4,0),FALSE)),\"\")","v":""},{"$f":"IFERROR(IF(VLOOKUP(P$16&$M$17&$M34,Data!$D:$X,MATCH(Login_Report!P$15,Data!$D$4:$X$4,0),FALSE)=0,\"\",VLOOKUP(P$16&$M$17&$M34,Data!$D:$X,MATCH(Login_Report!P$15,Data!$D$4:$X$4,0),FALSE)),\"\")","v":""},{"$f":"IFERROR(IF(VLOOKUP(Q$16&$M$17&$M34,Data!$D:$X,MATCH(Login_Report!Q$15,Data!$D$4:$X$4,0),FALSE)=0,\"\",VLOOKUP(Q$16&$M$17&$M34,Data!$D:$X,MATCH(Login_Report!Q$15,Data!$D$4:$X$4,0),FALSE)),\"\")","v":""},{"$f":"IFERROR(IF(VLOOKUP(R$16&$M$17&$M34,Data!$D:$X,MATCH(Login_Report!R$15,Data!$D$4:$X$4,0),FALSE)=0,\"\",VLOOKUP(R$16&$M$17&$M34,Data!$D:$X,MATCH(Login_Report!R$15,Data!$D$4:$X$4,0),FALSE)),\"\")","v":""},{"$f":"IFERROR(IF(VLOOKUP(S$16&$M$17&$M34,Data!$D:$X,MATCH(Login_Report!S$15,Data!$D$4:$X$4,0),FALSE)=0,\"\",VLOOKUP(S$16&$M$17&$M34,Data!$D:$X,MATCH(Login_Report!S$15,Data!$D$4:$X$4,0),FALSE)),\"\")","v":""},{"$f":"IFERROR(IF(VLOOKUP(T$16&$M$17&$M34,Data!$D:$X,MATCH(Login_Report!T$15,Data!$D$4:$X$4,0),FALSE)=0,\"\",VLOOKUP(T$16&$M$17&$M34,Data!$D:$X,MATCH(Login_Report!T$15,Data!$D$4:$X$4,0),FALSE)),\"\")","v":""},{"$f":"IFERROR(IF(VLOOKUP(U$16&$M$17&$M34,Data!$D:$X,MATCH(Login_Report!U$15,Data!$D$4:$X$4,0),FALSE)=0,\"\",VLOOKUP(U$16&$M$17&$M34,Data!$D:$X,MATCH(Login_Report!U$15,Data!$D$4:$X$4,0),FALSE)),\"\")","v":""},null,"",null,0,null,0,null,0,null,0,null,0,null,0,null,0,null,0,null,null,null,null,{"$f":"IF(Staff!D27=\"\",\"\",Staff!D27)","v":""},{"$f":"IFERROR(IF(VLOOKUP(AS$16&$AR34&$AR$17,Data!$D:$X,MATCH(Login_Report!AS$15,Data!$D$4:$X$4,0),FALSE)=0,\"\",VLOOKUP(AS$16&$AR34&$AR$17,Data!$D:$X,MATCH(Login_Report!AS$15,Data!$D$4:$X$4,0),FALSE)),\"\")","v":""},{"$f":"IFERROR(IF(VLOOKUP(AT$16&$AR34&$AR$17,Data!$D:$X,MATCH(Login_Report!AT$15,Data!$D$4:$X$4,0),FALSE)=0,\"\",VLOOKUP(AT$16&$AR34&$AR$17,Data!$D:$X,MATCH(Login_Report!AT$15,Data!$D$4:$X$4,0),FALSE)),\"\")","v":""},{"$f":"IFERROR(IF(VLOOKUP(AU$16&$AR34&$AR$17,Data!$D:$X,MATCH(Login_Report!AU$15,Data!$D$4:$X$4,0),FALSE)=0,\"\",VLOOKUP(AU$16&$AR34&$AR$17,Data!$D:$X,MATCH(Login_Report!AU$15,Data!$D$4:$X$4,0),FALSE)),\"\")","v":""},{"$f":"IFERROR(IF(VLOOKUP(AV$16&$AR34&$AR$17,Data!$D:$X,MATCH(Login_Report!AV$15,Data!$D$4:$X$4,0),FALSE)=0,\"\",VLOOKUP(AV$16&$AR34&$AR$17,Data!$D:$X,MATCH(Login_Report!AV$15,Data!$D$4:$X$4,0),FALSE)),\"\")","v":""},{"$f":"IFERROR(IF(VLOOKUP(AW$16&$AR34&$AR$17,Data!$D:$X,MATCH(Login_Report!AW$15,Data!$D$4:$X$4,0),FALSE)=0,\"\",VLOOKUP(AW$16&$AR34&$AR$17,Data!$D:$X,MATCH(Login_Report!AW$15,Data!$D$4:$X$4,0),FALSE)),\"\")","v":""},{"$f":"IFERROR(IF(VLOOKUP(AX$16&$AR34&$AR$17,Data!$D:$X,MATCH(Login_Report!AX$15,Data!$D$4:$X$4,0),FALSE)=0,\"\",VLOOKUP(AX$16&$AR34&$AR$17,Data!$D:$X,MATCH(Login_Report!AX$15,Data!$D$4:$X$4,0),FALSE)),\"\")","v":""},{"$f":"IFERROR(IF(VLOOKUP(AY$16&$AR34&$AR$17,Data!$D:$X,MATCH(Login_Report!AY$15,Data!$D$4:$X$4,0),FALSE)=0,\"\",VLOOKUP(AY$16&$AR34&$AR$17,Data!$D:$X,MATCH(Login_Report!AY$15,Data!$D$4:$X$4,0),FALSE)),\"\")","v":""},{"$f":"IFERROR(IF(VLOOKUP(AZ$16&$AR34&$AR$17,Data!$D:$X,MATCH(Login_Report!AZ$15,Data!$D$4:$X$4,0),FALSE)=0,\"\",VLOOKUP(AZ$16&$AR34&$AR$17,Data!$D:$X,MATCH(Login_Report!AZ$15,Data!$D$4:$X$4,0),FALSE)),\"\")","v":""},null,"",null,0,null,0,null,0,null,0]
[null,0,null,0,null,0,null,0,".",16,null,null,{"$f":"IF($D$15=\"OK\",I35,\".\")","v":"."},{"$f":"IFERROR(IF(VLOOKUP(N$16&$M$17&$M35,Data!$D:$X,MATCH(Login_Report!N$15,Data!$D$4:$X$4,0),FALSE)=0,\"\",VLOOKUP(N$16&$M$17&$M35,Data!$D:$X,MATCH(Login_Report!N$15,Data!$D$4:$X$4,0),FALSE)),\"\")","v":""},{"$f":"IFERROR(IF(VLOOKUP(O$16&$M$17&$M35,Data!$D:$X,MATCH(Login_Report!O$15,Data!$D$4:$X$4,0),FALSE)=0,\"\",VLOOKUP(O$16&$M$17&$M35,Data!$D:$X,MATCH(Login_Report!O$15,Data!$D$4:$X$4,0),FALSE)),\"\")","v":""},{"$f":"IFERROR(IF(VLOOKUP(P$16&$M$17&$M35,Data!$D:$X,MATCH(Login_Report!P$15,Data!$D$4:$X$4,0),FALSE)=0,\"\",VLOOKUP(P$16&$M$17&$M35,Data!$D:$X,MATCH(Login_Report!P$15,Data!$D$4:$X$4,0),FALSE)),\"\")","v":""},{"$f":"IFERROR(IF(VLOOKUP(Q$16&$M$17&$M35,Data!$D:$X,MATCH(Login_Report!Q$15,Data!$D$4:$X$4,0),FALSE)=0,\"\",VLOOKUP(Q$16&$M$17&$M35,Data!$D:$X,MATCH(Login_Report!Q$15,Data!$D$4:$X$4,0),FALSE)),\"\")","v":""},{"$f":"IFERROR(IF(VLOOKUP(R$16&$M$17&$M35,Data!$D:$X,MATCH(Login_Report!R$15,Data!$D$4:$X$4,0),FALSE)=0,\"\",VLOOKUP(R$16&$M$17&$M35,Data!$D:$X,MATCH(Login_Report!R$15,Data!$D$4:$X$4,0),FALSE)),\"\")","v":""},{"$f":"IFERROR(IF(VLOOKUP(S$16&$M$17&$M35,Data!$D:$X,MATCH(Login_Report!S$15,Data!$D$4:$X$4,0),FALSE)=0,\"\",VLOOKUP(S$16&$M$17&$M35,Data!$D:$X,MATCH(Login_Report!S$15,Data!$D$4:$X$4,0),FALSE)),\"\")","v":""},{"$f":"IFERROR(IF(VLOOKUP(T$16&$M$17&$M35,Data!$D:$X,MATCH(Login_Report!T$15,Data!$D$4:$X$4,0),FALSE)=0,\"\",VLOOKUP(T$16&$M$17&$M35,Data!$D:$X,MATCH(Login_Report!T$15,Data!$D$4:$X$4,0),FALSE)),\"\")","v":""},{"$f":"IFERROR(IF(VLOOKUP(U$16&$M$17&$M35,Data!$D:$X,MATCH(Login_Report!U$15,Data!$D$4:$X$4,0),FALSE)=0,\"\",VLOOKUP(U$16&$M$17&$M35,Data!$D:$X,MATCH(Login_Report!U$15,Data!$D$4:$X$4,0),FALSE)),\"\")","v":""},null,"",null,0,null,0,null,0,null,0,null,0,null,0,null,0,null,0,null,null,null,null,{"$f":"IF(Staff!D28=\"\",\"\",Staff!D28)","v":""},{"$f":"IFERROR(IF(VLOOKUP(AS$16&$AR35&$AR$17,Data!$D:$X,MATCH(Login_Report!AS$15,Data!$D$4:$X$4,0),FALSE)=0,\"\",VLOOKUP(AS$16&$AR35&$AR$17,Data!$D:$X,MATCH(Login_Report!AS$15,Data!$D$4:$X$4,0),FALSE)),\"\")","v":""},{"$f":"IFERROR(IF(VLOOKUP(AT$16&$AR35&$AR$17,Data!$D:$X,MATCH(Login_Report!AT$15,Data!$D$4:$X$4,0),FALSE)=0,\"\",VLOOKUP(AT$16&$AR35&$AR$17,Data!$D:$X,MATCH(Login_Report!AT$15,Data!$D$4:$X$4,0),FALSE)),\"\")","v":""},{"$f":"IFERROR(IF(VLOOKUP(AU$16&$AR35&$AR$17,Data!$D:$X,MATCH(Login_Report!AU$15,Data!$D$4:$X$4,0),FALSE)=0,\"\",VLOOKUP(AU$16&$AR35&$AR$17,Data!$D:$X,MATCH(Login_Report!AU$15,Data!$D$4:$X$4,0),FALSE)),\"\")","v":""},{"$f":"IFERROR(IF(VLOOKUP(AV$16&$AR35&$AR$17,Data!$D:$X,MATCH(Login_Report!AV$15,Data!$D$4:$X$4,0),FALSE)=0,\"\",VLOOKUP(AV$16&$AR35&$AR$17,Data!$D:$X,MATCH(Login_Report!AV$15,Data!$D$4:$X$4,0),FALSE)),\"\")","v":""},{"$f":"IFERROR(IF(VLOOKUP(AW$16&$AR35&$AR$17,Data!$D:$X,MATCH(Login_Report!AW$15,Data!$D$4:$X$4,0),FALSE)=0,\"\",VLOOKUP(AW$16&$AR35&$AR$17,Data!$D:$X,MATCH(Login_Report!AW$15,Data!$D$4:$X$4,0),FALSE)),\"\")","v":""},{"$f":"IFERROR(IF(VLOOKUP(AX$16&$AR35&$AR$17,Data!$D:$X,MATCH(Login_Report!AX$15,Data!$D$4:$X$4,0),FALSE)=0,\"\",VLOOKUP(AX$16&$AR35&$AR$17,Data!$D:$X,MATCH(Login_Report!AX$15,Data!$D$4:$X$4,0),FALSE)),\"\")","v":""},{"$f":"IFERROR(IF(VLOOKUP(AY$16&$AR35&$AR$17,Data!$D:$X,MATCH(Login_Report!AY$15,Data!$D$4:$X$4,0),FALSE)=0,\"\",VLOOKUP(AY$16&$AR35&$AR$17,Data!$D:$X,MATCH(Login_Report!AY$15,Data!$D$4:$X$4,0),FALSE)),\"\")","v":""},{"$f":"IFERROR(IF(VLOOKUP(AZ$16&$AR35&$AR$17,Data!$D:$X,MATCH(Login_Report!AZ$15,Data!$D$4:$X$4,0),FALSE)=0,\"\",VLOOKUP(AZ$16&$AR35&$AR$17,Data!$D:$X,MATCH(Login_Report!AZ$15,Data!$D$4:$X$4,0),FALSE)),\"\")","v":""},null,"",null,0,null,0,null,0,null,0]
[null,0,null,0,null,0,null,0,{"$f":"IF(J36>$L$16,\".\",I35+1)","v":"."},17,null,null,".",{"$f":"IFERROR(IF(VLOOKUP(N$16&$M$17&$M36,Data!$D:$X,MATCH(Login_Report!N$15,Data!$D$4:$X$4,0),FALSE)=0,\"\",VLOOKUP(N$16&$M$17&$M36,Data!$D:$X,MATCH(Login_Report!N$15,Data!$D$4:$X$4,0),FALSE)),\"\")","v":""},{"$f":"IFERROR(IF(VLOOKUP(O$16&$M$17&$M36,Data!$D:$X,MATCH(Login_Report!O$15,Data!$D$4:$X$4,0),FALSE)=0,\"\",VLOOKUP(O$16&$M$17&$M36,Data!$D:$X,MATCH(Login_Report!O$15,Data!$D$4:$X$4,0),FALSE)),\"\")","v":""},{"$f":"IFERROR(IF(VLOOKUP(P$16&$M$17&$M36,Data!$D:$X,MATCH(Login_Report!P$15,Data!$D$4:$X$4,0),FALSE)=0,\"\",VLOOKUP(P$16&$M$17&$M36,Data!$D:$X,MATCH(Login_Report!P$15,Data!$D$4:$X$4,0),FALSE)),\"\")","v":""},{"$f":"IFERROR(IF(VLOOKUP(Q$16&$M$17&$M36,Data!$D:$X,MATCH(Login_Report!Q$15,Data!$D$4:$X$4,0),FALSE)=0,\"\",VLOOKUP(Q$16&$M$17&$M36,Data!$D:$X,MATCH(Login_Report!Q$15,Data!$D$4:$X$4,0),FALSE)),\"\")","v":""},{"$f":"IFERROR(IF(VLOOKUP(R$16&$M$17&$M36,Data!$D:$X,MATCH(Login_Report!R$15,Data!$D$4:$X$4,0),FALSE)=0,\"\",VLOOKUP(R$16&$M$17&$M36,Data!$D:$X,MATCH(Login_Report!R$15,Data!$D$4:$X$4,0),FALSE)),\"\")","v":""},{"$f":"IFERROR(IF(VLOOKUP(S$16&$M$17&$M36,Data!$D:$X,MATCH(Login_Report!S$15,Data!$D$4:$X$4,0),FALSE)=0,\"\",VLOOKUP(S$16&$M$17&$M36,Data!$D:$X,MATCH(Login_Report!S$15,Data!$D$4:$X$4,0),FALSE)),\"\")","v":""},{"$f":"IFERROR(IF(VLOOKUP(T$16&$M$17&$M36,Data!$D:$X,MATCH(Login_Report!T$15,Data!$D$4:$X$4,0),FALSE)=0,\"\",VLOOKUP(T$16&$M$17&$M36,Data!$D:$X,MATCH(Login_Report!T$15,Data!$D$4:$X$4,0),FALSE)),\"\")","v":""},{"$f":"IFERROR(IF(VLOOKUP(U$16&$M$17&$M36,Data!$D:$X,MATCH(Login_Report!U$15,Data!$D$4:$X$4,0),FALSE)=0,\"\",VLOOKUP(U$16&$M$17&$M36,Data!$D:$X,MATCH(Login_Report!U$15,Data!$D$4:$X$4,0),FALSE)),\"\")","v":""},null,"",null,0,null,0,null,0,null,0,null,0,null,0,null,0,null,0,null,null,null,null,{"$f":"IF(Staff!D29=\"\",\"\",Staff!D29)","v":""},{"$f":"IFERROR(IF(VLOOKUP(AS$16&$AR36&$AR$17,Data!$D:$X,MATCH(Login_Report!AS$15,Data!$D$4:$X$4,0),FALSE)=0,\"\",VLOOKUP(AS$16&$AR36&$AR$17,Data!$D:$X,MATCH(Login_Report!AS$15,Data!$D$4:$X$4,0),FALSE)),\"\")","v":""},{"$f":"IFERROR(IF(VLOOKUP(AT$16&$AR36&$AR$17,Data!$D:$X,MATCH(Login_Report!AT$15,Data!$D$4:$X$4,0),FALSE)=0,\"\",VLOOKUP(AT$16&$AR36&$AR$17,Data!$D:$X,MATCH(Login_Report!AT$15,Data!$D$4:$X$4,0),FALSE)),\"\")","v":""},{"$f":"IFERROR(IF(VLOOKUP(AU$16&$AR36&$AR$17,Data!$D:$X,MATCH(Login_Report!AU$15,Data!$D$4:$X$4,0),FALSE)=0,\"\",VLOOKUP(AU$16&$AR36&$AR$17,Data!$D:$X,MATCH(Login_Report!AU$15,Data!$D$4:$X$4,0),FALSE)),\"\")","v":""},{"$f":"IFERROR(IF(VLOOKUP(AV$16&$AR36&$AR$17,Data!$D:$X,MATCH(Login_Report!AV$15,Data!$D$4:$X$4,0),FALSE)=0,\"\",VLOOKUP(AV$16&$AR36&$AR$17,Data!$D:$X,MATCH(Login_Report!AV$15,Data!$D$4:$X$4,0),FALSE)),\"\")","v":""},{"$f":"IFERROR(IF(VLOOKUP(AW$16&$AR36&$AR$17,Data!$D:$X,MATCH(Login_Report!AW$15,Data!$D$4:$X$4,0),FALSE)=0,\"\",VLOOKUP(AW$16&$AR36&$AR$17,Data!$D:$X,MATCH(Login_Report!AW$15,Data!$D$4:$X$4,0),FALSE)),\"\")","v":""},{"$f":"IFERROR(IF(VLOOKUP(AX$16&$AR36&$AR$17,Data!$D:$X,MATCH(Login_Report!AX$15,Data!$D$4:$X$4,0),FALSE)=0,\"\",VLOOKUP(AX$16&$AR36&$AR$17,Data!$D:$X,MATCH(Login_Report!AX$15,Data!$D$4:$X$4,0),FALSE)),\"\")","v":""},{"$f":"IFERROR(IF(VLOOKUP(AY$16&$AR36&$AR$17,Data!$D:$X,MATCH(Login_Report!AY$15,Data!$D$4:$X$4,0),FALSE)=0,\"\",VLOOKUP(AY$16&$AR36&$AR$17,Data!$D:$X,MATCH(Login_Report!AY$15,Data!$D$4:$X$4,0),FALSE)),\"\")","v":""},{"$f":"IFERROR(IF(VLOOKUP(AZ$16&$AR36&$AR$17,Data!$D:$X,MATCH(Login_Report!AZ$15,Data!$D$4:$X$4,0),FALSE)=0,\"\",VLOOKUP(AZ$16&$AR36&$AR$17,Data!$D:$X,MATCH(Login_Report!AZ$15,Data!$D$4:$X$4,0),FALSE)),\"\")","v":""},null,"",null,0,null,0,null,0,null,0]
[null,0,null,0,null,0,null,0,{"$f":"IF(J37>$L$16,\".\",I36+1)","v":"."},18,null,null,".",{"$f":"IFERROR(IF(VLOOKUP(N$16&$M$17&$M37,Data!$D:$X,MATCH(Login_Report!N$15,Data!$D$4:$X$4,0),FALSE)=0,\"\",VLOOKUP(N$16&$M$17&$M37,Data!$D:$X,MATCH(Login_Report!N$15,Data!$D$4:$X$4,0),FALSE)),\"\")","v":""},{"$f":"IFERROR(IF(VLOOKUP(O$16&$M$17&$M37,Data!$D:$X,MATCH(Login_Report!O$15,Data!$D$4:$X$4,0),FALSE)=0,\"\",VLOOKUP(O$16&$M$17&$M37,Data!$D:$X,MATCH(Login_Report!O$15,Data!$D$4:$X$4,0),FALSE)),\"\")","v":""},{"$f":"IFERROR(IF(VLOOKUP(P$16&$M$17&$M37,Data!$D:$X,MATCH(Login_Report!P$15,Data!$D$4:$X$4,0),FALSE)=0,\"\",VLOOKUP(P$16&$M$17&$M37,Data!$D:$X,MATCH(Login_Report!P$15,Data!$D$4:$X$4,0),FALSE)),\"\")","v":""},{"$f":"IFERROR(IF(VLOOKUP(Q$16&$M$17&$M37,Data!$D:$X,MATCH(Login_Report!Q$15,Data!$D$4:$X$4,0),FALSE)=0,\"\",VLOOKUP(Q$16&$M$17&$M37,Data!$D:$X,MATCH(Login_Report!Q$15,Data!$D$4:$X$4,0),FALSE)),\"\")","v":""},{"$f":"IFERROR(IF(VLOOKUP(R$16&$M$17&$M37,Data!$D:$X,MATCH(Login_Report!R$15,Data!$D$4:$X$4,0),FALSE)=0,\"\",VLOOKUP(R$16&$M$17&$M37,Data!$D:$X,MATCH(Login_Report!R$15,Data!$D$4:$X$4,0),FALSE)),\"\")","v":""},{"$f":"IFERROR(IF(VLOOKUP(S$16&$M$17&$M37,Data!$D:$X,MATCH(Login_Report!S$15,Data!$D$4:$X$4,0),FALSE)=0,\"\",VLOOKUP(S$16&$M$17&$M37,Data!$D:$X,MATCH(Login_Report!S$15,Data!$D$4:$X$4,0),FALSE)),\"\")","v":""},{"$f":"IFERROR(IF(VLOOKUP(T$16&$M$17&$M37,Data!$D:$X,MATCH(Login_Report!T$15,Data!$D$4:$X$4,0),FALSE)=0,\"\",VLOOKUP(T$16&$M$17&$M37,Data!$D:$X,MATCH(Login_Report!T$15,Data!$D$4:$X$4,0),FALSE)),\"\")","v":""},{"$f":"IFERROR(IF(VLOOKUP(U$16&$M$17&$M37,Data!$D:$X,MATCH(Login_Report!U$15,Data!$D$4:$X$4,0),FALSE)=0,\"\",VLOOKUP(U$16&$M$17&$M37,Data!$D:$X,MATCH(Login_Report!U$15,Data!$D$4:$X$4,0),FALSE)),\"\")","v":""},null,"",null,0,null,0,null,0,null,0,null,0,null,0,null,0,null,0,null,null,null,null,{"$f":"IF(Staff!D30=\"\",\"\",Staff!D30)","v":""},{"$f":"IFERROR(IF(VLOOKUP(AS$16&$AR37&$AR$17,Data!$D:$X,MATCH(Login_Report!AS$15,Data!$D$4:$X$4,0),FALSE)=0,\"\",VLOOKUP(AS$16&$AR37&$AR$17,Data!$D:$X,MATCH(Login_Report!AS$15,Data!$D$4:$X$4,0),FALSE)),\"\")","v":""},{"$f":"IFERROR(IF(VLOOKUP(AT$16&$AR37&$AR$17,Data!$D:$X,MATCH(Login_Report!AT$15,Data!$D$4:$X$4,0),FALSE)=0,\"\",VLOOKUP(AT$16&$AR37&$AR$17,Data!$D:$X,MATCH(Login_Report!AT$15,Data!$D$4:$X$4,0),FALSE)),\"\")","v":""},{"$f":"IFERROR(IF(VLOOKUP(AU$16&$AR37&$AR$17,Data!$D:$X,MATCH(Login_Report!AU$15,Data!$D$4:$X$4,0),FALSE)=0,\"\",VLOOKUP(AU$16&$AR37&$AR$17,Data!$D:$X,MATCH(Login_Report!AU$15,Data!$D$4:$X$4,0),FALSE)),\"\")","v":""},{"$f":"IFERROR(IF(VLOOKUP(AV$16&$AR37&$AR$17,Data!$D:$X,MATCH(Login_Report!AV$15,Data!$D$4:$X$4,0),FALSE)=0,\"\",VLOOKUP(AV$16&$AR37&$AR$17,Data!$D:$X,MATCH(Login_Report!AV$15,Data!$D$4:$X$4,0),FALSE)),\"\")","v":""},{"$f":"IFERROR(IF(VLOOKUP(AW$16&$AR37&$AR$17,Data!$D:$X,MATCH(Login_Report!AW$15,Data!$D$4:$X$4,0),FALSE)=0,\"\",VLOOKUP(AW$16&$AR37&$AR$17,Data!$D:$X,MATCH(Login_Report!AW$15,Data!$D$4:$X$4,0),FALSE)),\"\")","v":""},{"$f":"IFERROR(IF(VLOOKUP(AX$16&$AR37&$AR$17,Data!$D:$X,MATCH(Login_Report!AX$15,Data!$D$4:$X$4,0),FALSE)=0,\"\",VLOOKUP(AX$16&$AR37&$AR$17,Data!$D:$X,MATCH(Login_Report!AX$15,Data!$D$4:$X$4,0),FALSE)),\"\")","v":""},{"$f":"IFERROR(IF(VLOOKUP(AY$16&$AR37&$AR$17,Data!$D:$X,MATCH(Login_Report!AY$15,Data!$D$4:$X$4,0),FALSE)=0,\"\",VLOOKUP(AY$16&$AR37&$AR$17,Data!$D:$X,MATCH(Login_Report!AY$15,Data!$D$4:$X$4,0),FALSE)),\"\")","v":""},{"$f":"IFERROR(IF(VLOOKUP(AZ$16&$AR37&$AR$17,Data!$D:$X,MATCH(Login_Report!AZ$15,Data!$D$4:$X$4,0),FALSE)=0,\"\",VLOOKUP(AZ$16&$AR37&$AR$17,Data!$D:$X,MATCH(Login_Report!AZ$15,Data!$D$4:$X$4,0),FALSE)),\"\")","v":""},null,"",null,0,null,0,null,0,null,0]
[null,0,null,0,null,0,null,0,".",19,null,null,".",{"$f":"IFERROR(IF(VLOOKUP(N$16&$M$17&$M38,Data!$D:$X,MATCH(Login_Report!N$15,Data!$D$4:$X$4,0),FALSE)=0,\"\",VLOOKUP(N$16&$M$17&$M38,Data!$D:$X,MATCH(Login_Report!N$15,Data!$D$4:$X$4,0),FALSE)),\"\")","v":""},{"$f":"IFERROR(IF(VLOOKUP(O$16&$M$17&$M38,Data!$D:$X,MATCH(Login_Report!O$15,Data!$D$4:$X$4,0),FALSE)=0,\"\",VLOOKUP(O$16&$M$17&$M38,Data!$D:$X,MATCH(Login_Report!O$15,Data!$D$4:$X$4,0),FALSE)),\"\")","v":""},{"$f":"IFERROR(IF(VLOOKUP(P$16&$M$17&$M38,Data!$D:$X,MATCH(Login_Report!P$15,Data!$D$4:$X$4,0),FALSE)=0,\"\",VLOOKUP(P$16&$M$17&$M38,Data!$D:$X,MATCH(Login_Report!P$15,Data!$D$4:$X$4,0),FALSE)),\"\")","v":""},{"$f":"IFERROR(IF(VLOOKUP(Q$16&$M$17&$M38,Data!$D:$X,MATCH(Login_Report!Q$15,Data!$D$4:$X$4,0),FALSE)=0,\"\",VLOOKUP(Q$16&$M$17&$M38,Data!$D:$X,MATCH(Login_Report!Q$15,Data!$D$4:$X$4,0),FALSE)),\"\")","v":""},{"$f":"IFERROR(IF(VLOOKUP(R$16&$M$17&$M38,Data!$D:$X,MATCH(Login_Report!R$15,Data!$D$4:$X$4,0),FALSE)=0,\"\",VLOOKUP(R$16&$M$17&$M38,Data!$D:$X,MATCH(Login_Report!R$15,Data!$D$4:$X$4,0),FALSE)),\"\")","v":""},{"$f":"IFERROR(IF(VLOOKUP(S$16&$M$17&$M38,Data!$D:$X,MATCH(Login_Report!S$15,Data!$D$4:$X$4,0),FALSE)=0,\"\",VLOOKUP(S$16&$M$17&$M38,Data!$D:$X,MATCH(Login_Report!S$15,Data!$D$4:$X$4,0),FALSE)),\"\")","v":""},{"$f":"IFERROR(IF(VLOOKUP(T$16&$M$17&$M38,Data!$D:$X,MATCH(Login_Report!T$15,Data!$D$4:$X$4,0),FALSE)=0,\"\",VLOOKUP(T$16&$M$17&$M38,Data!$D:$X,MATCH(Login_Report!T$15,Data!$D$4:$X$4,0),FALSE)),\"\")","v":""},{"$f":"IFERROR(IF(VLOOKUP(U$16&$M$17&$M38,Data!$D:$X,MATCH(Login_Report!U$15,Data!$D$4:$X$4,0),FALSE)=0,\"\",VLOOKUP(U$16&$M$17&$M38,Data!$D:$X,MATCH(Login_Report!U$15,Data!$D$4:$X$4,0),FALSE)),\"\")","v":""},null,"",null,0,null,0,null,0,null,0,null,0,null,0,null,0,null,0,null,null,null,null,{"$f":"IF(Staff!D31=\"\",\"\",Staff!D31)","v":""},{"$f":"IFERROR(IF(VLOOKUP(AS$16&$AR38&$AR$17,Data!$D:$X,MATCH(Login_Report!AS$15,Data!$D$4:$X$4,0),FALSE)=0,\"\",VLOOKUP(AS$16&$AR38&$AR$17,Data!$D:$X,MATCH(Login_Report!AS$15,Data!$D$4:$X$4,0),FALSE)),\"\")","v":""},{"$f":"IFERROR(IF(VLOOKUP(AT$16&$AR38&$AR$17,Data!$D:$X,MATCH(Login_Report!AT$15,Data!$D$4:$X$4,0),FALSE)=0,\"\",VLOOKUP(AT$16&$AR38&$AR$17,Data!$D:$X,MATCH(Login_Report!AT$15,Data!$D$4:$X$4,0),FALSE)),\"\")","v":""},{"$f":"IFERROR(IF(VLOOKUP(AU$16&$AR38&$AR$17,Data!$D:$X,MATCH(Login_Report!AU$15,Data!$D$4:$X$4,0),FALSE)=0,\"\",VLOOKUP(AU$16&$AR38&$AR$17,Data!$D:$X,MATCH(Login_Report!AU$15,Data!$D$4:$X$4,0),FALSE)),\"\")","v":""},{"$f":"IFERROR(IF(VLOOKUP(AV$16&$AR38&$AR$17,Data!$D:$X,MATCH(Login_Report!AV$15,Data!$D$4:$X$4,0),FALSE)=0,\"\",VLOOKUP(AV$16&$AR38&$AR$17,Data!$D:$X,MATCH(Login_Report!AV$15,Data!$D$4:$X$4,0),FALSE)),\"\")","v":""},{"$f":"IFERROR(IF(VLOOKUP(AW$16&$AR38&$AR$17,Data!$D:$X,MATCH(Login_Report!AW$15,Data!$D$4:$X$4,0),FALSE)=0,\"\",VLOOKUP(AW$16&$AR38&$AR$17,Data!$D:$X,MATCH(Login_Report!AW$15,Data!$D$4:$X$4,0),FALSE)),\"\")","v":""},{"$f":"IFERROR(IF(VLOOKUP(AX$16&$AR38&$AR$17,Data!$D:$X,MATCH(Login_Report!AX$15,Data!$D$4:$X$4,0),FALSE)=0,\"\",VLOOKUP(AX$16&$AR38&$AR$17,Data!$D:$X,MATCH(Login_Report!AX$15,Data!$D$4:$X$4,0),FALSE)),\"\")","v":""},{"$f":"IFERROR(IF(VLOOKUP(AY$16&$AR38&$AR$17,Data!$D:$X,MATCH(Login_Report!AY$15,Data!$D$4:$X$4,0),FALSE)=0,\"\",VLOOKUP(AY$16&$AR38&$AR$17,Data!$D:$X,MATCH(Login_Report!AY$15,Data!$D$4:$X$4,0),FALSE)),\"\")","v":""},{"$f":"IFERROR(IF(VLOOKUP(AZ$16&$AR38&$AR$17,Data!$D:$X,MATCH(Login_Report!AZ$15,Data!$D$4:$X$4,0),FALSE)=0,\"\",VLOOKUP(AZ$16&$AR38&$AR$17,Data!$D:$X,MATCH(Login_Report!AZ$15,Data!$D$4:$X$4,0),FALSE)),\"\")","v":""},null,"",null,0,null,0,null,0,null,0]
[null,0,null,0,null,0,null,0,".",20,null,null,".",{"$f":"IFERROR(IF(VLOOKUP(N$16&$M$17&$M39,Data!$D:$X,MATCH(Login_Report!N$15,Data!$D$4:$X$4,0),FALSE)=0,\"\",VLOOKUP(N$16&$M$17&$M39,Data!$D:$X,MATCH(Login_Report!N$15,Data!$D$4:$X$4,0),FALSE)),\"\")","v":""},{"$f":"IFERROR(IF(VLOOKUP(O$16&$M$17&$M39,Data!$D:$X,MATCH(Login_Report!O$15,Data!$D$4:$X$4,0),FALSE)=0,\"\",VLOOKUP(O$16&$M$17&$M39,Data!$D:$X,MATCH(Login_Report!O$15,Data!$D$4:$X$4,0),FALSE)),\"\")","v":""},{"$f":"IFERROR(IF(VLOOKUP(P$16&$M$17&$M39,Data!$D:$X,MATCH(Login_Report!P$15,Data!$D$4:$X$4,0),FALSE)=0,\"\",VLOOKUP(P$16&$M$17&$M39,Data!$D:$X,MATCH(Login_Report!P$15,Data!$D$4:$X$4,0),FALSE)),\"\")","v":""},{"$f":"IFERROR(IF(VLOOKUP(Q$16&$M$17&$M39,Data!$D:$X,MATCH(Login_Report!Q$15,Data!$D$4:$X$4,0),FALSE)=0,\"\",VLOOKUP(Q$16&$M$17&$M39,Data!$D:$X,MATCH(Login_Report!Q$15,Data!$D$4:$X$4,0),FALSE)),\"\")","v":""},{"$f":"IFERROR(IF(VLOOKUP(R$16&$M$17&$M39,Data!$D:$X,MATCH(Login_Report!R$15,Data!$D$4:$X$4,0),FALSE)=0,\"\",VLOOKUP(R$16&$M$17&$M39,Data!$D:$X,MATCH(Login_Report!R$15,Data!$D$4:$X$4,0),FALSE)),\"\")","v":""},{"$f":"IFERROR(IF(VLOOKUP(S$16&$M$17&$M39,Data!$D:$X,MATCH(Login_Report!S$15,Data!$D$4:$X$4,0),FALSE)=0,\"\",VLOOKUP(S$16&$M$17&$M39,Data!$D:$X,MATCH(Login_Report!S$15,Data!$D$4:$X$4,0),FALSE)),\"\")","v":""},{"$f":"IFERROR(IF(VLOOKUP(T$16&$M$17&$M39,Data!$D:$X,MATCH(Login_Report!T$15,Data!$D$4:$X$4,0),FALSE)=0,\"\",VLOOKUP(T$16&$M$17&$M39,Data!$D:$X,MATCH(Login_Report!T$15,Data!$D$4:$X$4,0),FALSE)),\"\")","v":""},{"$f":"IFERROR(IF(VLOOKUP(U$16&$M$17&$M39,Data!$D:$X,MATCH(Login_Report!U$15,Data!$D$4:$X$4,0),FALSE)=0,\"\",VLOOKUP(U$16&$M$17&$M39,Data!$D:$X,MATCH(Login_Report!U$15,Data!$D$4:$X$4,0),FALSE)),\"\")","v":""},null,"",null,0,null,0,null,0,null,0,null,0,null,0,null,0,null,0,null,null,null,null,{"$f":"IF(Staff!D32=\"\",\"\",Staff!D32)","v":""},{"$f":"IFERROR(IF(VLOOKUP(AS$16&$AR39&$AR$17,Data!$D:$X,MATCH(Login_Report!AS$15,Data!$D$4:$X$4,0),FALSE)=0,\"\",VLOOKUP(AS$16&$AR39&$AR$17,Data!$D:$X,MATCH(Login_Report!AS$15,Data!$D$4:$X$4,0),FALSE)),\"\")","v":""},{"$f":"IFERROR(IF(VLOOKUP(AT$16&$AR39&$AR$17,Data!$D:$X,MATCH(Login_Report!AT$15,Data!$D$4:$X$4,0),FALSE)=0,\"\",VLOOKUP(AT$16&$AR39&$AR$17,Data!$D:$X,MATCH(Login_Report!AT$15,Data!$D$4:$X$4,0),FALSE)),\"\")","v":""},{"$f":"IFERROR(IF(VLOOKUP(AU$16&$AR39&$AR$17,Data!$D:$X,MATCH(Login_Report!AU$15,Data!$D$4:$X$4,0),FALSE)=0,\"\",VLOOKUP(AU$16&$AR39&$AR$17,Data!$D:$X,MATCH(Login_Report!AU$15,Data!$D$4:$X$4,0),FALSE)),\"\")","v":""},{"$f":"IFERROR(IF(VLOOKUP(AV$16&$AR39&$AR$17,Data!$D:$X,MATCH(Login_Report!AV$15,Data!$D$4:$X$4,0),FALSE)=0,\"\",VLOOKUP(AV$16&$AR39&$AR$17,Data!$D:$X,MATCH(Login_Report!AV$15,Data!$D$4:$X$4,0),FALSE)),\"\")","v":""},{"$f":"IFERROR(IF(VLOOKUP(AW$16&$AR39&$AR$17,Data!$D:$X,MATCH(Login_Report!AW$15,Data!$D$4:$X$4,0),FALSE)=0,\"\",VLOOKUP(AW$16&$AR39&$AR$17,Data!$D:$X,MATCH(Login_Report!AW$15,Data!$D$4:$X$4,0),FALSE)),\"\")","v":""},{"$f":"IFERROR(IF(VLOOKUP(AX$16&$AR39&$AR$17,Data!$D:$X,MATCH(Login_Report!AX$15,Data!$D$4:$X$4,0),FALSE)=0,\"\",VLOOKUP(AX$16&$AR39&$AR$17,Data!$D:$X,MATCH(Login_Report!AX$15,Data!$D$4:$X$4,0),FALSE)),\"\")","v":""},{"$f":"IFERROR(IF(VLOOKUP(AY$16&$AR39&$AR$17,Data!$D:$X,MATCH(Login_Report!AY$15,Data!$D$4:$X$4,0),FALSE)=0,\"\",VLOOKUP(AY$16&$AR39&$AR$17,Data!$D:$X,MATCH(Login_Report!AY$15,Data!$D$4:$X$4,0),FALSE)),\"\")","v":""},{"$f":"IFERROR(IF(VLOOKUP(AZ$16&$AR39&$AR$17,Data!$D:$X,MATCH(Login_Report!AZ$15,Data!$D$4:$X$4,0),FALSE)=0,\"\",VLOOKUP(AZ$16&$AR39&$AR$17,Data!$D:$X,MATCH(Login_Report!AZ$15,Data!$D$4:$X$4,0),FALSE)),\"\")","v":""},null,"",null,0,null,0,null,0,null,0]

{"sheet":"Reports","index":8,"n_rows":40,"n_cols":16,"rows_kept":40,"cut":false,"hidden":true,"merged":[]}
[]
[]
[]
[]
[]
[]
[null,null,null,null,{"$f":"\"Pay Period \"&$B$18&\":\"","v":"Pay Period (All):"},{"$f":"IFERROR(VLOOKUP($B$18,Admin!$E:$G,3,FALSE),\"\")","v":""},null,null,null,null,null,null,null,null,{"$f":"IFERROR(IF(K7=\"\",\"\",VLOOKUP(K7,Staff!D:L,6,FALSE)),\"\")","v":""},{"$f":"IF(K7=\"\",\"\",O7*N7)","v":""}]
[null,null,null,null,"Total Hours Period",null,null,null,null,null,"Total Hours Period by Week & Day"]
[null,null,null,null,null,null,null,null,null,null,"Sum of Hours Worked",null,"Months","Date"]
[null,null,null,null,"Name","Hours Worked ","# Holidays in Period","Holiday Hours","TOTAL HOURS",null,null,null,"Oct","Grand Total"]
[null,null,null,null,"Rey",1.7083333223126829E-3,{"$f":"IFERROR(IF(E11=\"\",\"\",VLOOKUP($B$18,Admin!E:F,2,FALSE)),\"\")","v":""},{"$f":"IFERROR(IF(E11=\"\",\"\",VLOOKUP(E11,Staff!D:H,5,FALSE)*G11),\"\")","v":""},{"$f":"IFERROR(IF(E11=\"\",\"\",H11+F11),\"\")","v":""},null,"Name","Week"]
[null,null,null,null,null,null,{"$f":"IFERROR(IF(E12=\"\",\"\",VLOOKUP($B$18,Admin!E:F,2,FALSE)),\"\")","v":""},{"$f":"IFERROR(IF(E12=\"\",\"\",VLOOKUP(E12,Staff!D:H,5,FALSE)*G12),\"\")","v":""},{"$f":"IFERROR(IF(E12=\"\",\"\",H12+F12),\"\")","v":""},null,"Rey",42,1.7083333223126829E-3,1.7083333223126829E-3]
[null,null,null,null,null,null,{"$f":"IFERROR(IF(E13=\"\",\"\",VLOOKUP($B$18,Admin!E:F,2,FALSE)),\"\")","v":""},{"$f":"IFERROR(IF(E13=\"\",\"\",VLOOKUP(E13,Staff!D:H,5,FALSE)*G13),\"\")","v":""},"",null,"Rey Total",null,1.7083333223126829E-3,1.7083333223126829E-3]
[null,null,null,null,null,null,{"$f":"IFERROR(IF(E14=\"\",\"\",VLOOKUP($B$18,Admin!E:F,2,FALSE)),\"\")","v":""},{"$f":"IFERROR(IF(E14=\"\",\"\",VLOOKUP(E14,Staff!D:H,5,FALSE)*G14),\"\")","v":""},"",null,"Grand Total",null,1.7083333223126829E-3,1.7083333223126829E-3]
[null,null,null,null,null,null,{"$f":"IFERROR(IF(E15=\"\",\"\",VLOOKUP($B$18,Admin!E:F,2,FALSE)),\"\")","v":""},{"$f":"IFERROR(IF(E15=\"\",\"\",VLOOKUP(E15,Staff!D:H,5,FALSE)*G15),\"\")","v":""},""]
[null,null,null,null,null,null,{"$f":"IFERROR(IF(E16=\"\",\"\",VLOOKUP($B$18,Admin!E:F,2,FALSE)),\"\")","v":""},{"$f":"IFERROR(IF(E16=\"\",\"\",VLOOKUP(E16,Staff!D:H,5,FALSE)*G16),\"\")","v":""},""]
["Year","(All)",null,null,null,null,{"$f":"IFERROR(IF(E17=\"\",\"\",VLOOKUP($B$18,Admin!E:F,2,FALSE)),\"\")","v":""},{"$f":"IFERROR(IF(E17=\"\",\"\",VLOOKUP(E17,Staff!D:H,5,FALSE)*G17),\"\")","v":""},""]
["Pay Period","(All)",null,null,null,null,{"$f":"IFERROR(IF(E18=\"\",\"\",VLOOKUP($B$18,Admin!E:F,2,FALSE)),\"\")","v":""},{"$f":"IFERROR(IF(E18=\"\",\"\",VLOOKUP(E18,Staff!D:H,5,FALSE)*G18),\"\")","v":""},""]
[null,null,null,null,null,null,{"$f":"IFERROR(IF(E19=\"\",\"\",VLOOKUP($B$18,Admin!E:F,2,FALSE)),\"\")","v":""},{"$f":"IFERROR(IF(E19=\"\",\"\",VLOOKUP(E19,Staff!D:H,5,FALSE)*G19),\"\")","v":""},""]
[null,null,null,null,null,null,{"$f":"IFERROR(IF(E20=\"\",\"\",VLOOKUP($B$18,Admin!E:F,2,FALSE)),\"\")","v":""},{"$f":"IFERROR(IF(E20=\"\",\"\",VLOOKUP(E20,Staff!D:H,5,FALSE)*G20),\"\")","v":""},""]
[null,null,null,null,null,null,{"$f":"IFERROR(IF(E21=\"\",\"\",VLOOKUP($B$18,Admin!E:F,2,FALSE)),\"\")","v":""},{"$f":"IFERROR(IF(E21=\"\",\"\",VLOOKUP(E21,Staff!D:H,5,FALSE)*G21),\"\")","v":""},""]
[null,null,null,null,null,null,{"$f":"IFERROR(IF(E22=\"\",\"\",VLOOKUP($B$18,Admin!E:F,2,FALSE)),\"\")","v":""},{"$f":"IFERROR(IF(E22=\"\",\"\",VLOOKUP(E22,Staff!D:H,5,FALSE)*G22),\"\")","v":""},""]
[null,null,null,null,null,null,{"$f":"IFERROR(IF(E23=\"\",\"\",VLOOKUP($B$18,Admin!E:F,2,FALSE)),\"\")","v":""},{"$f":"IFERROR(IF(E23=\"\",\"\",VLOOKUP(E23,Staff!D:H,5,FALSE)*G23),\"\")","v":""},""]
[null,null,null,null,null,null,{"$f":"IFERROR(IF(E24=\"\",\"\",VLOOKUP($B$18,Admin!E:F,2,FALSE)),\"\")","v":""},{"$f":"IFERROR(IF(E24=\"\",\"\",VLOOKUP(E24,Staff!D:H,5,FALSE)*G24),\"\")","v":""},""]
[null,null,null,null,null,null,{"$f":"IFERROR(IF(E25=\"\",\"\",VLOOKUP($B$18,Admin!E:F,2,FALSE)),\"\")","v":""},{"$f":"IFERROR(IF(E25=\"\",\"\",VLOOKUP(E25,Staff!D:H,5,FALSE)*G25),\"\")","v":""},""]
[null,null,null,null,null,null,{"$f":"IFERROR(IF(E26=\"\",\"\",VLOOKUP($B$18,Admin!E:F,2,FALSE)),\"\")","v":""},{"$f":"IFERROR(IF(E26=\"\",\"\",VLOOKUP(E26,Staff!D:H,5,FALSE)*G26),\"\")","v":""},""]
[null,null,null,null,null,null,{"$f":"IFERROR(IF(E27=\"\",\"\",VLOOKUP($B$18,Admin!E:F,2,FALSE)),\"\")","v":""},{"$f":"IFERROR(IF(E27=\"\",\"\",VLOOKUP(E27,Staff!D:H,5,FALSE)*G27),\"\")","v":""},""]
[null,null,null,null,null,null,{"$f":"IFERROR(IF(E28=\"\",\"\",VLOOKUP($B$18,Admin!E:F,2,FALSE)),\"\")","v":""},{"$f":"IFERROR(IF(E28=\"\",\"\",VLOOKUP(E28,Staff!D:H,5,FALSE)*G28),\"\")","v":""},""]
[null,null,null,null,null,null,{"$f":"IFERROR(IF(E29=\"\",\"\",VLOOKUP($B$18,Admin!E:F,2,FALSE)),\"\")","v":""},{"$f":"IFERROR(IF(E29=\"\",\"\",VLOOKUP(E29,Staff!D:H,5,FALSE)*G29),\"\")","v":""},""]
[null,null,null,null,null,null,{"$f":"IFERROR(IF(E30=\"\",\"\",VLOOKUP($B$18,Admin!E:F,2,FALSE)),\"\")","v":""},{"$f":"IFERROR(IF(E30=\"\",\"\",VLOOKUP(E30,Staff!D:H,5,FALSE)*G30),\"\")","v":""},""]
[null,null,null,null,null,null,{"$f":"IFERROR(IF(E31=\"\",\"\",VLOOKUP($B$18,Admin!E:F,2,FALSE)),\"\")","v":""},{"$f":"IFERROR(IF(E31=\"\",\"\",VLOOKUP(E31,Staff!D:H,5,FALSE)*G31),\"\")","v":""},""]
[null,null,null,null,null,null,{"$f":"IFERROR(IF(E32=\"\",\"\",VLOOKUP($B$18,Admin!E:F,2,FALSE)),\"\")","v":""},{"$f":"IFERROR(IF(E32=\"\",\"\",VLOOKUP(E32,Staff!D:H,5,FALSE)*G32),\"\")","v":""},""]
[null,null,null,null,null,null,{"$f":"IFERROR(IF(E33=\"\",\"\",VLOOKUP($B$18,Admin!E:F,2,FALSE)),\"\")","v":""},{"$f":"IFERROR(IF(E33=\"\",\"\",VLOOKUP(E33,Staff!D:H,5,FALSE)*G33),\"\")","v":""},""]
[null,null,null,null,null,null,{"$f":"IFERROR(IF(E34=\"\",\"\",VLOOKUP($B$18,Admin!E:F,2,FALSE)),\"\")","v":""},{"$f":"IFERROR(IF(E34=\"\",\"\",VLOOKUP(E34,Staff!D:H,5,FALSE)*G34),\"\")","v":""},""]
[null,null,null,null,null,null,{"$f":"IFERROR(IF(E35=\"\",\"\",VLOOKUP($B$18,Admin!E:F,2,FALSE)),\"\")","v":""},{"$f":"IFERROR(IF(E35=\"\",\"\",VLOOKUP(E35,Staff!D:H,5,FALSE)*G35),\"\")","v":""},""]
[null,null,null,null,null,null,{"$f":"IFERROR(IF(E36=\"\",\"\",VLOOKUP($B$18,Admin!E:F,2,FALSE)),\"\")","v":""},{"$f":"IFERROR(IF(E36=\"\",\"\",VLOOKUP(E36,Staff!D:H,5,FALSE)*G36),\"\")","v":""},""]
[null,null,null,null,null,null,{"$f":"IFERROR(IF(E37=\"\",\"\",VLOOKUP($B$18,Admin!E:F,2,FALSE)),\"\")","v":""},{"$f":"IFERROR(IF(E37=\"\",\"\",VLOOKUP(E37,Staff!D:H,5,FALSE)*G37),\"\")","v":""},""]
[null,null,null,null,null,null,{"$f":"IFERROR(IF(E38=\"\",\"\",VLOOKUP($B$18,Admin!E:F,2,FALSE)),\"\")","v":""},{"$f":"IFERROR(IF(E38=\"\",\"\",VLOOKUP(E38,Staff!D:H,5,FALSE)*G38),\"\")","v":""},""]
[null,null,null,null,null,null,{"$f":"IFERROR(IF(E39=\"\",\"\",VLOOKUP($B$18,Admin!E:F,2,FALSE)),\"\")","v":""},{"$f":"IFERROR(IF(E39=\"\",\"\",VLOOKUP(E39,Staff!D:H,5,FALSE)*G39),\"\")","v":""},""]
[null,null,null,null,null,null,{"$f":"IFERROR(IF(E40=\"\",\"\",VLOOKUP($B$18,Admin!E:F,2,FALSE)),\"\")","v":""},{"$f":"IFERROR(IF(E40=\"\",\"\",VLOOKUP(E40,Staff!D:H,5,FALSE)*G40),\"\")","v":""},""]

{"sheet":"Data","index":9,"n_rows":5,"n_cols":24,"rows_kept":5,"cut":false,"hidden":true,"merged":[]}
["Count",{"$f":"COUNTA(T5:T199989)+5","v":5},null,null,1,{"$f":"24*60*60","v":86400}]
[]
[null,{"$f":"IF(T3=\"\",\"NO\",\"OK\")","v":"OK"},{"$f":"COUNTIFS(T3:T$4,T3,U3:U$4,U3,W3:W$4,W3)","v":0},{"$f":"C3&T3&U3","v":"0RAW DATA "},{"$f":"IF(X3=\"\",0,X3-V3)","v":0},{"$f":"IFERROR(E3*$F$1/60/60,0)","v":0},{"$f":"MONTH(U3)","v":1},{"$f":"YEAR(U3)","v":1900},{"$f":"WEEKNUM(U3)","v":0},{"$f":"TEXT(WEEKDAY(U3,1),\"ddd\")","v":"Sat"},{"$f":"VLOOKUP(U3,Admin!C:F,3)","v":{"$error":"#N/A"}},{"$f":"VLOOKUP($T3,Staff!$D:$L,3,FALSE)","v":{"$error":"#N/A"}},{"$f":"VLOOKUP($T3,Staff!$D:$L,2,FALSE)","v":{"$error":"#N/A"}},{"$f":"VLOOKUP($T3,Staff!$D:$L,5,FALSE)","v":{"$error":"#N/A"}},{"$f":"VLOOKUP($T3,Staff!$D:$L,4,FALSE)","v":{"$error":"#N/A"}},{"$f":"O3*F3","v":{"$error":"#N/A"}},null,null,null,"RAW DATA "]
[null,"Check","Count In","Unique","Difference","Hours Worked","Month","Year","Week","Week Day","Pay Period","Part/Full Time","Type","Vacation","Rate","Pay","xxx","xxxx","xxxxx","Name","Date","Time IN","Type","Time OUT"]
[null,"OK"]

{"sheet":"Support","index":10,"n_rows":20,"n_cols":8,"rows_kept":20,"cut":false,"hidden":false,"merged":[]}
[]
[]
[]
[]
[null,null,null,null,"Support"]
[]
[null,null,null,null,null,"License Serial #:",null,{"$f":"Profile!$G$8","v":0}]
[]
[null,null,null,null,null,"support@rcubesolutions.ca"]
[null,null,null,null,null,"If applicable, please attach screen shots of the related topic your are emailing us about."]
[]
[]
[]
[null,null,null,null,null," 1-800-291-9608"]
[null,null,null,null,null,"We might be busy when you call. Feel free to leave us a voicemail."]
[]
[]
[]
[null,null,null,null,null,"www.rcubesolutions.ca"]
[null,null,null,null,null,"Visit our website for more information"]

{"sheet":"Profile","index":11,"n_rows":48,"n_cols":8,"rows_kept":48,"cut":false,"hidden":false,"merged":[[1,4,1,7]]}
[]
[null,null,null,null,{"$f":"Admin_License!D2","v":"THE USER AGREEMENT HAS NOT BEEN ACCEPTED YET. PLEASE DO SO FIRST"}]
[null,null,null,null,null,"YOUR PROFILE"]
[null,null,null,null,null,"Today's Date:",{"$f":"NOW()","v":"2017-11-26T23:18:56.240"}]
[]
[null,null,null,null,null,"Contact Information (Update GREEN Cells is applicable)"]
[]
[null,null,null,null,null,"License Serial #"]
[null,null,null,null,null,"Full Name"]
[null,null,null,null,null,"Club Name"]
[null,null,null,null,null,"* Email"]
[null,null,null,null,null,"* Phone #"]
[null,null,null,null,null,"Address 1"]
[null,null,null,null,null,"Address 2"]
[null,null,null,null,null,"* City"]
[null,null,null,null,null,"* Province / State"]
[null,null,null,null,null,"Postal Code"]
[null,null,null,null,null,"Country"]
[null,null,null,null,null,"Parent License",null,"."]
[]
[]
[]
[null,null,null,null,null,{"$f":"\"License & Registration information / Version: \"&Admin_License!N39","v":"License & Registration information / Version: V004"}]
[null,null,null,null,null,"Registered to:",{"$f":"G9","v":0}]
[null,null,null,null,null,"Computer User Name:",{"$f":"IF(Admin_License!A2<=3,Profile!G43,Admin_License!AE2)","v":0}]
[null,null,null,null,null,"Version",{"$f":"Home!K8","v":"version 3.3"}]
[null,null,null,null,null,"Trial Start Date:",{"$f":"IF(Admin_License!$A$2<=3,Admin_License!K2,\"Not Applicable\")","v":"Not Applicable"}]
[null,null,null,null,null,"Trial end Day:",{"$f":"IF(Admin_License!$A$2<=3,Admin_License!K4,\"Not Applicable\")","v":"Not Applicable"}]
[null,null,null,null,null,"Trial Days Left:",{"$f":"IF(Admin_License!$A$2<=3,IF(Admin_License!K6<0,\"Trial Expired\",Admin_License!K6&\" Days\"),\"Not Applicable\")","v":"Not Applicable"}]
[]
[null,null,null,null,null,"Last Payment Date:",{"$f":"IF(Admin_License!$A$2<=3,\"Trial Version\",IF(Admin_License!AD2=0,\"No Payment yet\",Admin_License!AD2))","v":"No Payment yet"}]
[null,null,null,null,null,"# of Days to Renew:",{"$f":"IFERROR(VLOOKUP(Admin_License!A2,Admin_License!A17:C24,3,FALSE),\"\")","v":"User Agreement Hasn'T Been Accepted"}]
[]
[]
[]
[]
[]
[]
[]
[]
[]
[null,null,null,null,null,"Registered to:"]
[null,null,null,null,null,"User Name"]
[null,null,null,null,null,"Computer Name"]
[null,null,null,null,null,"Date"]
[null,null,null,null,null,"Current user:"]
[null,null,null,null,null,"User Name",{"$f":"Admin_License!N10","v":"RCUBE Solutions"}]
[null,null,null,null,null,"Computer Name",{"$f":"Admin_License!N11","v":"RCUBESOLUTIONS"}]

{"sheet":"RCUBE","index":12,"n_rows":21,"n_cols":14,"rows_kept":21,"cut":false,"hidden":true,"merged":[]}
["xxx"]
[null,null,null,"Today",0,null,null,null,null,null,null,null,"Countries"]
["Where I am at",null,null,"Yesterday",1,null,null,null,null,null,null,null,"Canada","CA"]
["GEN LICENSE INFO",null,null,"2 days ago",2,null,null,null,null,null,null,null,"United States","US"]
[null,null,null,"3 days ago",3,null,null,null,null,null,null,null,"Mexico","MX"]
[null,null,null,null,null,null,null,null,null,null,null,null,"United Kingdom","UK"]
[null,null,null,null,null,null,null,null,null,null,null,null,"Other","OT"]
[null,null,null,null,null,null,null,null,null,null,null,null,"."]
[null,null,null,null,null,null,null,null,null,null,null,null,"."]
[null,null,null,null,"2017-09-30",{"$f":"TODAY()","v":"2017-11-26"},{"$f":"VLOOKUP(Admin_License!A2,RCUBE!C14:D21,2,FALSE)","v":"NO"},null,null,null,null,null,"."]
[null,null,null,null,null,null,null,null,null,null,null,null,"."]
[null,null,null,null,null,null,null,null,null,null,null,null,"."]
[null,null,null,null,null,null,null,null,null,null,null,null,"."]
[null,null,1,"OK",{"$f":"\"THIS IS A NON-REGISTERED AND UN-SUPPORTED LIMITED TRIAL LICENSE  WITH \"&M14&\" DAYS LEFT - RECOMMENDED TO REGISTER YOU LICENSE BY GOING TO THE LICENSE SECTION\"","v":"THIS IS A NON-REGISTERED AND UN-SUPPORTED LIMITED TRIAL LICENSE  WITH . DAYS LEFT - RECOMMENDED TO REGISTER YOU LICENSE BY GOING TO THE LICENSE SECTION"},null,null,null,null,null,null,null,"."]
[null,null,2,"OK",{"$f":"\"THIS IS A TRIAL LICENSE WITH \"&M14&\" DAYS LEFT\"","v":"THIS IS A TRIAL LICENSE WITH . DAYS LEFT"}]
[null,null,3,"NO",{"$f":"\"THIS IS AN EXPIRED TRIAL LICENSE - PLEASE GO TO LICENSE SECTION TO PURCHASE A FULL LICENSE\"","v":"THIS IS AN EXPIRED TRIAL LICENSE - PLEASE GO TO LICENSE SECTION TO PURCHASE A FULL LICENSE"}]
[null,null,4,"OK",{"$f":"\"THIS IS A FULL LICENSE WITH \"&M28&\" DAYS LEFT\"","v":"THIS IS A FULL LICENSE WITH  DAYS LEFT"}]
[null,null,5,"NO",{"$f":"\"THIS IS AN EXPIRED FULL LICENSE - PLEASE GO TO LICENSE SECTION TO RENEW YOUR LICENSE\"","v":"THIS IS AN EXPIRED FULL LICENSE - PLEASE GO TO LICENSE SECTION TO RENEW YOUR LICENSE"}]
[null,null,6,"NO",{"$f":"\"CURRENT USER IS NOT THE AUTHORIZED USER OF THIS LICENSE - PLEASE GO TO THE LICENSE SECTION FOR MORE INFORMATION\"","v":"CURRENT USER IS NOT THE AUTHORIZED USER OF THIS LICENSE - PLEASE GO TO THE LICENSE SECTION FOR MORE INFORMATION"}]
[null,null,7,"NO",{"$f":"\"THIS LICENSE WAS CANCELLED / UPGRADED / TRANSFER BY THE USER - CONTACT SUPPORT IF YOU THINK THIS IS A MISTAKE\"","v":"THIS LICENSE WAS CANCELLED / UPGRADED / TRANSFER BY THE USER - CONTACT SUPPORT IF YOU THINK THIS IS A MISTAKE"}]
[null,null,8,"NO","THE USER AGREEMENT HAS NOT BEEN ACCEPTED YET. PLEASE DO SO FIRST"]

{"sheet":"Admin_License","index":13,"n_rows":49,"n_cols":39,"rows_kept":49,"cut":false,"hidden":true,"merged":[]}
["STATUS",null,null,null,null,null,null,null,null,"Trial","TRIAL 1",null,null,"MUST Validations",null,null,null,null,null,null,null,null,null,null,null,null,null,"Unique_ID","Standing","Payment date","User","PC","Multiple Users","Bill Cycle","xx","Message"]
[{"$f":"IF(K30=\"OK\",IF(AB2=\"\",1,IF(M3=\"CANCELLED\",7,IF(M3=\"New\",IF(K6>=0,2,3),IF(O6=0,IF(K21=\"OK\",4,5),6)))),8)","v":8},{"$f":"IF(AC2=\"\",1,IF(N3=\"CANCELLED\",7,IF(N3=\"New\",IF(L6>=0,2,3),IF(P6=0,IF(L21=\"OK\",4,5),6))))","v":1},null,{"$f":"VLOOKUP(A2,A6:C14,3,FALSE)","v":"THE USER AGREEMENT HAS NOT BEEN ACCEPTED YET. PLEASE DO SO FIRST"},null,null,null,null,null,"Start date",{"$f":"IF(AND(AC2=\"TRIAL\",AD2>0),AD2,IF(User_Agreement!C52=\"\",TODAY(),User_Agreement!C52))","v":"2017-11-26"},null,null,"Validate",{"$f":"IF(AD2=\"OK\",0,SUM(O3:O16))","v":0},null,null,null,null,null,null,null,null,null,null,null,null,null,null,null,null,null,null,null,null,null,"","",60]
["F",null,null,null,null,null,null,null,null,"Trial Days",12,null,{"$f":"IF(OR(AC2=\"\",AC2=\"TRIAL\"),\"New\",AC2)","v":"New"},"Good Standing",{"$f":"IF(M3=\"New\",0,IF(K21=\"OK\",0,1))","v":0}]
[null,null,null,null,null,null,null,null,null,"Expiry Date",{"$f":"K2+K3","v":"2017-12-08"},null,{"$f":"M3","v":"New"},"30 day Trial",{"$f":"IF(M4<>\"New\",0,IF(K7=\"OK\",0,1))","v":0},null,null,null,null,null,null,null,"2017-09-10T00:30:33"]
[null,null,null,null,null,null,null,null,null,"Today",{"$f":"TODAY()","v":"2017-11-26"},null,{"$f":"M4","v":"New"},"Trial Overall",{"$f":"IF(M5<>\"New\",0,IF(K15=\"OK\",0,1))","v":0},{"$f":"IF(N5<>\"New\",0,IF(L15=\"OK\",0,1))","v":0}]
[1,"1-Trial Not regiestered",{"$f":"\"THIS IS A NON-REGISTERED AND UN-SUPPORTED LIMITED TRIAL LICENSE  WITH \"&K$6&\" DAYS LEFT - RECOMMENDED TO REGISTER YOU LICENSE BY GOING TO THE LICENSE SECTION\"","v":"THIS IS A NON-REGISTERED AND UN-SUPPORTED LIMITED TRIAL LICENSE  WITH 12 DAYS LEFT - RECOMMENDED TO REGISTER YOU LICENSE BY GOING TO THE LICENSE SECTION"},null,null,null,null,null,null,"Days Left",{"$f":"ROUND(K4-K5,0)","v":12},null,{"$f":"M5","v":"New"},"User Validation",{"$f":"IF(OR(M6=\"New\",AG2=\"Y\"),0,IF(AND(N10=AE2,AF2=N11),0,1))","v":0}]
[2,"2-Trial Registered",{"$f":"\"THIS IS A TRIAL LICENSE WITH \"&K$6&\" DAYS LEFT\"","v":"THIS IS A TRIAL LICENSE WITH 12 DAYS LEFT"},null,null,null,null,null,null,"OK",{"$f":"IF(K6>0,\"OK\",\"NO\")","v":"OK"}]
[3,"3-Trial Expired",{"$f":"\"THIS IS AN EXPIRED TRIAL LICENSE - PLEASE GO TO LICENSE SECTION TO PURCHASE A FULL LICENSE\"","v":"THIS IS AN EXPIRED TRIAL LICENSE - PLEASE GO TO LICENSE SECTION TO PURCHASE A FULL LICENSE"}]
[4,"4-Full Paid",{"$f":"\"THIS IS A FULL LICENSE WITH \"&K$20&\" DAYS LEFT\"","v":"THIS IS A FULL LICENSE WITH -43065 DAYS LEFT"},null,null,null,null,null,null,"Overall",null,null,"Logged as"]
[5,"5-Full Expired",{"$f":"\"THIS IS AN EXPIRED FULL LICENSE - PLEASE GO TO LICENSE SECTION TO RENEW YOUR LICENSE\"","v":"THIS IS AN EXPIRED FULL LICENSE - PLEASE GO TO LICENSE SECTION TO RENEW YOUR LICENSE"},null,null,null,null,null,null,"Start date",{"$f":"N36","v":"2017-11-20"},null,"User","RCUBE Solutions"]
[6,"6-Invalid User License",{"$f":"\"CURRENT USER IS NOT THE AUTHORIZED USER OF THIS LICENSE - PLEASE GO TO THE LICENSE SECTION FOR MORE INFORMATION\"","v":"CURRENT USER IS NOT THE AUTHORIZED USER OF THIS LICENSE - PLEASE GO TO THE LICENSE SECTION FOR MORE INFORMATION"},null,null,null,null,null,null,"Trial Days",120,null,"Computer","RCUBESOLUTIONS"]
[7,"7-Cancelled License",{"$f":"\"THIS LICENSE WAS CANCELLED / UPGRADED / TRANSFER BY THE USER - CONTACT SUPPORT IF YOU THINK THIS IS A MISTAKE\"","v":"THIS LICENSE WAS CANCELLED / UPGRADED / TRANSFER BY THE USER - CONTACT SUPPORT IF YOU THINK THIS IS A MISTAKE"},null,null,null,null,null,null,"Expiry Date",{"$f":"K10+K11","v":"2018-03-20"}]
[8,"8-No Agreement","THE USER AGREEMENT HAS NOT BEEN ACCEPTED YET. PLEASE DO SO FIRST",null,null,null,null,null,null,"Today",{"$f":"TODAY()","v":"2017-11-26"}]
[null,null,null,null,null,null,null,null,null,"Days Left",{"$f":"K12-K13","v":114}]
[null,null,null,null,null,null,null,null,null,"OK",{"$f":"IF(K14>0,\"OK\",\"NO\")","v":"OK"}]
[]
[1,null,{"$f":"PROPER(\"TRIAL LICENSE  WITH \"&K$6&\" DAYS LEFT\")","v":"Trial License  With 12 Days Left"},null,null,null,null,null,null,"License Paid Thru"]
[2,null,{"$f":"PROPER(\"TRIAL LICENSE  WITH \"&K$6&\" DAYS LEFT\")","v":"Trial License  With 12 Days Left"},null,null,null,null,null,null,"Expiry Date",{"$f":"AD2+AH2","v":"00:00:00"}]
[3,null,{"$f":"\"Trial License EXPIRED\"","v":"Trial License EXPIRED"},null,null,null,null,null,null,"Today",{"$f":"TODAY()","v":"2017-11-26"}]
[4,null,{"$f":"PROPER(\"FULL LICENSE WITH \"&K$20&\" DAYS LEFT\")","v":"Full License With -43065 Days Left"},null,null,null,null,null,null,"Days Left",{"$f":"ROUND(K18-K19,0)","v":-43065}]
[5,null,{"$f":"\"EXPIRED FULL LICENSE\"","v":"EXPIRED FULL LICENSE"},null,null,null,null,null,null,"OK",{"$f":"IF(K20>0,\"OK\",\"NO\")","v":"NO"}]
[6,null,"Contact Support"]
[7,null,"Contact Support"]
[8,null,{"$f":"PROPER(\"USER AGREEMENT HASN'T BEEN ACCEPTED\")","v":"User Agreement Hasn'T Been Accepted"}]
[null,null,null,null,null,null,null,null,null,"REGISTRATION DATE"]
[null,null,null,null,null,null,null,null,null,"Date",{"$f":"Profile!G45","v":"00:00:00"}]
[]
[null,null,null,null,null,null,null,null,null,null,null,null,"Version",{"$f":"N39","v":"V004"}]
[null,null,null,null,null,null,null,null,null,"LICENSE AGREEMENT",null,null,"Sport","ALL"]
[null,null,null,null,null,null,null,null,null,"Signed?",{"$f":"IF(User_Agreement!C52=\"\",\"NO\",\"OK\")","v":"NO"}]
[]
[null,null,null,null,null,null,null,null,null,null,null,null,null,null,"ENTER CLIENT ID:",{"$f":"N39&N40&N41&N42&N43&N44","v":"V004ENXXGN0007XXXXXXXX0001"}]
[]
[null,null,null,null,null,null,null,null,null,null,null,null,null,null,"Todays Date",{"$f":"TODAY()","v":"2017-11-26"}]
[null,null,null,null,null,null,null,null,null,null,null,null,null,"Launch date"]
[null,null,null,null,null,null,null,null,null,null,null,null,null,"2017-11-20"]
[]
[]
[null,null,null,null,null,null,null,null,null,null,null,null,"Version","V004"]
[null,null,null,null,null,null,null,null,null,null,null,null,"Model",{"$f":"N47&N48&N49","v":"ENXXGN"}]
[null,null,null,null,null,null,null,null,null,null,null,null,"Days",{"$f":"TEXT(ROUND(P34-N36,0)+1,\"0000\")","v":"0007"}]
[null,null,null,null,null,null,null,null,null,null,null,null,"Club",{"$f":"IF(O42=4,P42,IF(O42=3,P42&\"X\",IF(O42=2,P42&\"XX\",IF(O42=1,P42&\"XXX\",\"XXXX\"))))","v":"XXXX"},{"$f":"LEN(P42)","v":4},{"$f":"IF(Registration!F15=\"\",\"XXXX\",UPPER(LEFT(Registration!F15,4)))","v":"XXXX"}]
[null,null,null,null,null,null,null,null,null,null,null,null,"User/PC",{"$f":"IF(O43=4,P43,IF(O43=3,P43&\"X\",IF(O43=2,P43&\"XX\",IF(O43=1,P43&\"XXX\",\"XXXX\"))))","v":"XXXX"},{"$f":"LEN(P43)","v":4},{"$f":"IF(Registration!F14=\"\",\"XXXX\",UPPER(LEFT(Registration!F14,4)))","v":"XXXX"}]
[null,null,null,null,null,null,null,null,null,null,null,null,"Download Source",{"$f":"Enable!B3","v":"0001"}]
[]
[]
[null,null,null,null,null,null,null,null,null,null,null,null,"Model Language","EN"]
[null,null,null,null,null,null,null,null,null,null,null,null,"Model Country",{"$f":"IFERROR(VLOOKUP(Registration!F23,RCUBE!M:N,2,FALSE),\"XX\")","v":"XX"}]
[null,null,null,null,null,null,null,null,null,null,null,null,"Model Business","GN"]

{"sheet":"Checkin Log","index":14,"n_rows":241,"n_cols":25,"rows_kept":241,"cut":false,"hidden":true,"merged":[]}
["Checkin Number","User Name","Computer Name","Log date","Year","Month","Week","Weekday",{"$f":"COUNTA(B1:B1500)+1","v":2},null,null,null,{"$f":"COUNTA(O1:O150000)+1","v":2},"Usage Track #","User Name","Computer Name","Open Date",null,null,null,null,null,null,"Last Login","Sub savepdfma()"]
[null,null,null,null,null,null,null,null,null,null,null,null,null,null,null,null,null,null,null,null,null,null,{"$f":"\"O\"&M1-1","v":"O1"},{"$f":"INDIRECT(W2)","v":"User Name"},"Sub folders"]
[null,null,null,null,null,null,null,null,null,null,null,null,null,null,null,null,null,null,null,null,null,null,{"$f":"\"P\"&M1-1","v":"P1"},{"$f":"INDIRECT(W3)","v":"Computer Name"},"UDF module"]
[null,null,null,null,null,null,null,null,null,null,null,null,null,null,null,null,null,null,null,null,null,null,"2017-10-23T22:21:44",{"$f":"X2&\" - \"&X3","v":"User Name - Computer Name"},"RefPIVOTS"]
[null,null,null,null,null,null,null,null,null,null,null,null,null,null,null,null,null,null,null,null,null,null,null,"Last Checkin file"]
[]
[]
[]
[]
[]
[]
[]
[]
[]
[]
[]
[]
[]
[{"$f":"IFERROR(IF(B19=\"\",\"\",A18+1),1)","v":""}]
[""]
[""]
[""]
[""]
[""]
[""]
[""]
[""]
[""]
[""]
[""]
[""]
[""]
[""]
[""]
[""]
[""]
[""]
[""]
[""]
[""]
[""]
[""]
[""]
[""]
[""]
[""]
[""]
[""]
[""]
[""]
[""]
[""]
[""]
[""]
["",null,null,null,null,null,"Reinaldo"]
["",null,null,null,null,null,"RCUBESOLUTIONS"]
[""]
[""]
[""]
[""]
[""]
[""]
[""]
[""]
[""]
[""]
[""]
[""]
[""]
[""]
[""]
[""]
[""]
[""]
[""]
[""]
[""]
[""]
[""]
[""]
[""]
[""]
[{"$f":"IFERROR(IF(B83=\"\",\"\",A82+1),1)","v":""}]
[""]
[""]
[""]
[""]
[""]
[""]
[""]
[""]
[""]
[""]
[""]
[""]
[""]
[""]
[""]
[""]
[""]
[""]
[""]
[""]
[""]
[""]
[""]
[""]
[""]
[""]
[""]
[""]
[""]
[""]
[""]
[""]
[""]
[""]
[""]
[""]
[""]
[""]
[""]
[""]
[""]
[""]
[""]
[""]
[""]
[""]
[""]
[""]
[""]
[""]
[""]
[""]
[""]
[""]
[""]
[""]
[""]
[""]
[""]
[""]
[""]
[""]
[""]
[{"$f":"IFERROR(IF(B147=\"\",\"\",A146+1),1)","v":""}]
[""]
[""]
[""]
[""]
[""]
[""]
[""]
[""]
[""]
[""]
[""]
[""]
[""]
[""]
[""]
[""]
[""]
[""]
[""]
[""]
[""]
[""]
[""]
[""]
[""]
[""]
[""]
[""]
[""]
[""]
[""]
[""]
[""]
[""]
[""]
[""]
[""]
[""]
[""]
[""]
[""]
[""]
[""]
[""]
[""]
[""]
[""]
[""]
[""]
[""]
[""]
[""]
[""]
[""]
[""]
[""]
[""]
[""]
[""]
[""]
[""]
[""]
[""]
[{"$f":"IFERROR(IF(B211=\"\",\"\",A210+1),1)","v":""}]
[""]
[""]
[""]
[""]
[""]
[""]
[""]
[""]
[""]
[""]
[""]
[""]
[""]
[""]
[""]
[""]
[""]
[""]
[""]
[""]
[""]
[""]
[""]
[""]
[""]
[""]
[""]
[""]
[""]
[""]

{"sheet":"MM","index":15,"n_rows":182,"n_cols":12,"rows_kept":182,"cut":false,"hidden":true,"merged":[]}
["Unique_ID","Standing","Payment date","User","PC","Multiple Users","Bill Cycle","Last Pay","Message","Next Payment","Authorized COMPUTER","Amount"]
["V003ENCAGN0001RCUBREYX0002","N",43023,"RCUBE Solutions","RCUBESOLUTIONS","N",30,"","Tom, please contact me when you can","3","",60]
["V004ENCAGN0001CUBERRXX0001","OK",43059,"RCUBE Solutions","RCUBESOLUTIONS","N",10,"3","Testing new functionality","3","",60]
["","",null,"","","",null,"","","",""]
["","",null,"","","",null,"","","",""]
["","",null,"","","",null,"","","",""]
["","",null,"","","",null,"","","",""]
["","",null,"","","",null,"","","",""]
["","",null,"","","",null,"","","",""]
["","",null,"","","",null,"","","",""]
["","",null,"","","",null,"","","",""]
["","",null,"","","",null,"","","",""]
["","",null,"","","",null,"","","",""]
["","",null,"","","",null,"","","",""]
["","",null,"","","",null,"","","",""]
["","",null,"","","",null,"","","",""]
["","",null,"","","",null,"","","",""]
["","",null,"","","",null,"","","",""]
["","",null,"","","",null,"","","",""]
["","",null,"","","",null,"","","",""]
["","",null,"","","",null,"","","",""]
["","",null,"","","",null,"","","",""]
["","",null,"","","",null,"","","",""]
["","",null,"","","",null,"","","",""]
["","",null,"","","",null,"","","",""]
["","",null,"","","",null,"","","",""]
["","",null,"","","",null,"","","",""]
["","",null,"","","",null,"","","",""]
["","",null,"","","",null,"","","",""]
["",".",null,"","","",null,"","","",""]
["","",null,"","","",null,"","","",""]
["","",null,"","","",null,"","","",""]
["","",null,"","","",null,"","","",""]
["","",null,"","","",null,"","","",""]
["","",null,"","","",null,"","","",""]
["","",null,"","","",null,"","","",""]
["","",null,"","","",null,"","","",""]
["","",null,"","","",null,"","","",""]
["","",null,"","","",null,"","","",""]
["","",null,"","","",null,"","","",""]
["","",null,"","","",null,"","","",""]
["","",null,"","","",null,"","","",""]
["","",null,"","","",null,"","","",""]
["","",null,"","","",null,"","","",""]
["","",null,"","","",null,"","","",""]
["","",null,"","","",null,"","","",""]
["","",null,"","","",null,"","","",""]
["","",null,"","","",null,"","","",""]
["","",null,"","","",null,"","","",""]
["","",null,"","","",null,"","","",""]
["","",null,"","","",null,"","","",""]
["","",null,"","","",null,"","","",""]
["","",null,"","","",null,"","","",""]
["","",null,"","","",null,"","","",""]
["","",null,"","","",null,"","","",""]
["","",null,"","","",null,"","","",""]
["","",null,"","","",null,"","","",""]
["","",null,"","","",null,"","","",""]
["","",null,"","","",null,"","","",""]
["","",null,"","","",null,"","","",""]
["","",null,"","","",null,"","","",""]
["","",null,"","","",null,"","","",""]
["","",null,"","","",null,"","","",""]
["","",null,"","","",null,"","","",""]
["","",null,"","","",null,"","","",""]
["","",null,"","","",null,"","","",""]
["","",null,"","","",null,"","","",""]
["","",null,"","","",null,"","","",""]
["","",null,"","","",null,"","","",""]
["","",null,"","","",null,"","","",""]
["","",null,"","","",null,"","","",""]
["","",null,"","","",null,"","","",""]
["","",null,"","","",null,"","","",""]
["","",null,"","","",null,"","","",""]
["","",null,"","","",null,"","","",""]
["","",null,"","","",null,"","","",""]
["","",null,"","","",null,"","","",""]
["","",null,"","","",null,"","","",""]
["","",null,"","","",null,"","","",""]
["","",null,"","","",null,"","","",""]
["","",null,"","","",null,"","","",""]
["","",null,"","","",null,"","","",""]
["","",null,"","","",null,"","","",""]
["","",null,"","","",null,"","","",""]
["","",null,"","","",null,"","","",""]
["","",null,"","","",null,"","","",""]
["","",null,"","","",null,"","","",""]
["","",null,"","","",null,"","","",""]
["","",null,"","","",null,"","","",""]
["","",null,"","","",null,"","","",""]
["","",null,"","","",null,"","","",""]
["","",null,"","","",null,"","","",""]
["","",null,"","","",null,"","","",""]
["","",null,"","","",null,"","","",""]
["","",null,"","","",null,"","","",""]
["","",null,"","","",null,"","","",""]
["","",null,"","","",null,"","","",""]
["","",null,"","","",null,"","","",""]
["","",null,"","","",null,"","","",""]
["","",null,"","","",null,"","","",""]
["","",null,"","","",null,"","","",""]
["","",null,"","","",null,"","","",""]
["","",null,"","","",null,"","","",""]
["","",null,"","","",null,"","","",""]
["","",null,"","","",null,"","","",""]
["","",null,"","","",null,"","","",""]
["","",null,"","","",null,"","","",""]
["","",null,"","","",null,"","","",""]
["","",null,"","","",null,"","","",""]
["","",null,"","","",null,"","","",""]
["","",null,"","","",null,"","","",""]
["","",null,"","","",null,"","","",""]
["","",null,"","","",null,"","","",""]
["","",null,"","","",null,"","","",""]
["","",null,"","","",null,"","","",""]
["","",null,"","","",null,"","","",""]
["","",null,"","","",null,"","","",""]
["","",null,"","","",null,"","","",""]
["","",null,"","","",null,"","","",""]
["","",null,"","","",null,"","","",""]
["","",null,"","","",null,"","","",""]
["","",null,"","","",null,"","","",""]
["","",null,"","","",null,"","","",""]
["","",null,"","","",null,"","","",""]
["","",null,"","","",null,"","","",""]
["","",null,"","","",null,"","","",""]
["","",null,"","","",null,"","","",""]
["","",null,"","","",null,"","","",""]
["","",null,"","","",null,"","","",""]
["","",null,"","","",null,"","","",""]
["","",null,"","","",null,"","","",""]
["","",null,"","","",null,"","","",""]
["","",null,"","","",null,"","","",""]
["","",null,"","","",null,"","","",""]
["","",null,"","","",null,"","","",""]
["","",null,"","","",null,"","","",""]
["","",null,"","","",null,"","","",""]
["","",null,"","","",null,"","","",""]
["","",null,"","","",null,"","","",""]
["","",null,"","","",null,"","","",""]
["","",null,"","","",null,"","","",""]
["","",null,"","","",null,"","","",""]
["","",null,"","","",null,"","","",""]
["","",null,"","","",null,"","","",""]
["","",null,"","","",null,"","","",""]
["","",null,"","","",null,"","","",""]
["","",null,"","","",null,"","","",""]
["","",null,"","","",null,"","","",""]
["","",null,"","","",null,"","","",""]
["","",null,"","","",null,"","","",""]
["","",null,"","","",null,"","","",""]
["","",null,"","","",null,"","","",""]
["","",null,"","","",null,"","","",""]
["","",null,"","","",null,"","","",""]
["","",null,"","","",null,"","","",""]
["","",null,"","","",null,"","","",""]
["","",null,"","","",null,"","","",""]
["","",null,"","","",null,"","","",""]
["","",null,"","","",null,"","","",""]
["","",null,"","","",null,"","","",""]
["","",null,"","","",null,"","","",""]
["","",null,"","","",null,"","","",""]
["","",null,"","","",null,"","","",""]
["","",null,"","","",null,"","","",""]
["","",null,"","","",null,"","","",""]
["","",null,"","","",null,"","","",""]
["","",null,"","","",null,"","","",""]
["","",null,"","","",null,"","","",""]
["","",null,"","","",null,"","","",""]
["","",null,"","","",null,"","","",""]
["","",null,"","","",null,"","","",""]
["","",null,"","","",null,"","","",""]
["","",null,"","","",null,"","","",""]
["","",null,"","","",null,"","","",""]
["","",null,"","","",null,"","","",""]
["","",null,"","","",null,"","","",""]
["","",null,"","","",null,"","","",""]
["","",null,"","","",null,"","","",""]
["","",null,"","","",null,"","","",""]
["","",null,"","","",null,"","","",""]
["","",null,"","","",null,"","","",""]
["","",null,"","","",null,"","","",""]

{"sheet":"How_To","index":16,"n_rows":20,"n_cols":7,"rows_kept":20,"cut":false,"hidden":true,"merged":[[20,4,20,5],[20,6,20,10],[21,4,21,5],[21,6,21,10],[22,4,22,5],[22,6,22,10],[23,4,23,5],[23,6,23,10],[24,4,24,5],[24,6,24,10],[25,4,25,5],[25,6,25,10],[26,4,26,5],[26,6,26,10],[27,4,27,5],[27,6,27,10],[28,4,28,5],[28,6,28,10],[29,4,29,5],[29,6,29,10],[30,4,30,5],[30,6,30,10],[31,4,31,5],[31,6,31,10],[32,4,32,5],[32,6,32,10],[33,4,33,5],[33,6,33,10],[34,4,34,5],[34,6,34,10],[35,4,35,5],[35,6,35,10],[36,4,36,5],[36,6,36,10],[37,4,37,5],[37,6,37,10],[38,4,38,5],[38,6,38,10],[39,4,39,5],[39,6,39,10],[40,4,40,5],[40,6,40,10]]}
[]
[]
[]
[]
[null,null,null,null,"How to's"]
[]
[]
[null,null,null,null,"This software was meant to be user friendly and common sense driven,"]
[null,null,null,null,"so that the need of How To's was not that important."]
[null,null,null,null,"But we also know that is always good to have some materials to help or "]
[null,null,null,null,"guide our users. "]
[null,null,null,null,"Anywhere you see this icon               , you can click on it to access detailed"]
[null,null,null,null,"information on that section."]
[null,null,null,null,"Below is a list of all the supporting materials."]
[null,null,null,null,"Please click on the Topic you need more info for."]
[]
[null,null,null,null,"NOTE: You need to be connected to the internet to access the supporting"]
[null,null,null,null,"materials"]
[]
[null,null,null,"Section","Material",null,"Description"]

{"sheet":"License_Page","index":17,"n_rows":43,"n_cols":30,"rows_kept":43,"cut":false,"hidden":true,"merged":[]}
[{"$f":"Profile!G8","v":0}]
[]
[]
[null,null,null,null,"LICENSING",null,null,null,null,null,null,null,null,null,null,null,null,"Renewal / Purchase"]
[null,null,null,null,"License Serial #:"]
[]
[null,null,null,null,null,null,null,null,null,null,null,null,null,null,null,null,null,null,"Please contact us at info@rcubesolutions.ca"]
[]
[null,null,null,null,null,null,null,null,null,null,null,null,null,null,null,null,null,null,"or click on the link for more information:  ",null,null,null,null,null,null,"http://tournamentscheduler.ca/pricing/"]
[]
[]
[]
[]
[]
[]
[]
[]
[]
[]
[]
[]
[]
[]
[]
[]
[]
[]
[]
[]
[]
[]
[]
[]
[]
[]
[null,null,null,null,null,null,null,null,null,null,null,null,null,null,null,null,null,null,"1)","CLICK HERE to find the plan that meets your needs."]
[]
[null,null,null,null,null,null,null,null,null,null,null,null,null,null,null,null,null,null,"2)","Make Payment thru PayPal to: billing@rcubesolutions.ca "]
[null,null,null,null,null,null,null,null,null,null,null,null,null,null,null,null,null,null,null,"Make sure that you include in the message you License Serial #:",null,null,null,null,null,null,null,null,null,{"$f":"Profile!G8","v":0}]
[]
[]
[null,null,null,null,null,null,null,null,null,null,null,null,null,null,null,null,null,null,"3)","Once you get email confirmation from us (24-48 hours)"]
[null,null,null,null,null,null,null,null,null,null,null,null,null,null,null,null,null,null,null,"click on \"Update License Info\" and you will be good to go."]